{"text_format":"3","workbook":"xlsx","n_sheets":7,"sheets":["Overview","Individual","HHH","LewesAC","Phoenix","BHR","Sheet3"],"not_rendered":{"external_links":1,"defined_names":7,"comments":4},"read":"whole","date_system":"1900"}

{"sheet":"Overview","index":0,"n_rows":29,"n_cols":15,"rows_kept":29,"merged":[[0,3,0,14],[2,3,2,12],[4,3,4,12]]}
[{"$nulls":3},"Team Results from the 2020 Virtual Blackcap race in memory of Chris Smith"]
[]
[{"$nulls":3},"Winners - BRIGHTON PHOENIX"]
[]
[{"$nulls":3},"Team Times (each M U45, U60, O60 ; F U45, U60, O60 \n- with substitutes/adjusts)"]
[]
[{"$nulls":3},"Team","A","B","C","D","E","F","G","H","I"]
[{"$nulls":3},"Club"]
[{"$nulls":3},"HHH",{"$f":"HHH!AD4","v":0.15531261574074073},{"$f":"HHH!AE4","v":0.16415192592592592},{"$f":"HHH!AF4","v":0.17008687037037037},{"$f":"HHH!AG4","v":0.17304339185185183},{"$f":"HHH!AH4","v":0.18006149305555552},{"$f":"HHH!AI4","v":0.18248765046296297},{"$f":"HHH!AJ4","v":0.19154981481481484},{"$f":"HHH!AK4","v":0.18727002314814817}]
[{"$nulls":3},"Lewes",{"$f":"LewesAC!Z4","v":0.1591898148148148},{"$f":"LewesAC!AA4","v":0.17035879629629627},{"$f":"LewesAC!AB4","v":0.17510405555555555},{"$f":"LewesAC!AC4","v":0.18671029629629632},{"$f":"LewesAC!AD4","v":0.18822337962962962},{"$f":"LewesAC!AE4","v":0.20132536168981482}]
[{"$nulls":3},"Phoenix",{"$f":"Phoenix!AF4","v":0.15130787037037038},{"$f":"Phoenix!AG4","v":0.15675716666666667},{"$f":"Phoenix!AH4","v":0.16371533333333332},{"$f":"Phoenix!AI4","v":0.1706122037037037},{"$f":"Phoenix!AJ4","v":0.1759850925925926},{"$f":"Phoenix!AK4","v":0.178783668595679},{"$f":"Phoenix!AL4","v":0.19443831944444445},{"$f":"Phoenix!AM4","v":0.21011747685185186},{"$f":"Phoenix!AN4","v":0.18311554819315845}]
[{"$nulls":3},"BHR",{"$f":"BHR!X4","v":0.17614583333333333},{"$f":"BHR!Y4","v":0.2045601851851852},{"$f":"BHR!Z4","v":0.20736612962962964},{"$f":"BHR!AA4","v":0.24226268518518518}]
[]
[{"$nulls":3},"Rank each category",{"$nulls":10},"Rank 1 Count"]
[{"$nulls":3},"HHH",{"$f":"RANK(E9,E$9:E$12,1)","v":2},{"$f":"RANK(F9,F$9:F$12,1)","v":2},2,2,2,2,1,{"$f":"RANK(L9,L$9:L$12,1)","v":1},{"$error":"#N/A"},null,{"$f":"COUNTIF(E15:M15,1)","v":2}]
[{"$nulls":3},"Lewes",{"$f":"RANK(E10,E$9:E$12,1)","v":3},3,3,3,3,3,{"$error":"#N/A"},{"$f":"RANK(L10,L$9:L$12,1)","v":{"$error":"#N/A"}},{"$error":"#N/A"},null,{"$f":"COUNTIF(E16:M16,1)","v":0}]
[{"$nulls":3},"Phoenix",1,1,1,1,1,1,2,{"$f":"RANK(L11,L$9:L$12,1)","v":2},1,null,7]
[{"$nulls":3},"BHR",4,4,4,4,{"$error":"#N/A"},{"$error":"#N/A"},{"$error":"#N/A"},{"$f":"RANK(L12,L$9:L$12,1)","v":{"$error":"#N/A"}},{"$error":"#N/A"},null,0]
[]
[{"$nulls":3},"Runners"]
[{"$nulls":7},"all Clubs",null,"HHH","Lewes","PHX","BHR"]
[{"$nulls":3},"HHH",{"$f":"COUNTIF(Individual!$AA$7:$AA$160,Overview!D22)","v":44},null,"F S",{"$f":"COUNTIF(Individual!$AD$7:$AD$160,Overview!G22)","v":27},null,{"$f":"SUM((J$21=Individual!$AA$8:$AA$160)*(Overview!$G22=Individual!$AD$8:$AD$160))","v":8},{"$f":"SUM((K$21=Individual!$AA$8:$AA$160)*(Overview!$G22=Individual!$AD$8:$AD$160))","v":4},{"$f":"SUM((L$21=Individual!$AA$8:$AA$160)*(Overview!$G22=Individual!$AD$8:$AD$160))","v":11},{"$f":"SUM((M$21=Individual!$AA$8:$AA$160)*(Overview!$G22=Individual!$AD$8:$AD$160))","v":4}]
[{"$nulls":3},"Lewes",{"$f":"COUNTIF(Individual!$AA$7:$AA$160,Overview!D23)","v":36},null,"M S",{"$f":"COUNTIF(Individual!$AD$7:$AD$160,Overview!G23)","v":30},null,{"$f":"SUM((J$21=Individual!$AA$8:$AA$160)*(Overview!$G23=Individual!$AD$8:$AD$160))","v":13},{"$f":"SUM((K$21=Individual!$AA$8:$AA$160)*(Overview!$G23=Individual!$AD$8:$AD$160))","v":1},{"$f":"SUM((L$21=Individual!$AA$8:$AA$160)*(Overview!$G23=Individual!$AD$8:$AD$160))","v":10},{"$f":"SUM((M$21=Individual!$AA$8:$AA$160)*(Overview!$G23=Individual!$AD$8:$AD$160))","v":6}]
[{"$nulls":3},"PHX",{"$f":"COUNTIF(Individual!$AA$7:$AA$160,Overview!D24)","v":50},null,"F V",{"$f":"COUNTIF(Individual!$AD$7:$AD$160,Overview!G24)","v":20},null,{"$f":"SUM((J$21=Individual!$AA$8:$AA$160)*(Overview!$G24=Individual!$AD$8:$AD$160))","v":5},{"$f":"SUM((K$21=Individual!$AA$8:$AA$160)*(Overview!$G24=Individual!$AD$8:$AD$160))","v":7},{"$f":"SUM((L$21=Individual!$AA$8:$AA$160)*(Overview!$G24=Individual!$AD$8:$AD$160))","v":6},{"$f":"SUM((M$21=Individual!$AA$8:$AA$160)*(Overview!$G24=Individual!$AD$8:$AD$160))","v":2}]
[{"$nulls":3},"BHR",{"$f":"COUNTIF(Individual!$AA$7:$AA$160,Overview!D25)","v":23},null,"M V",{"$f":"COUNTIF(Individual!$AD$7:$AD$160,Overview!G25)","v":49},null,{"$f":"SUM((J$21=Individual!$AA$8:$AA$160)*(Overview!$G25=Individual!$AD$8:$AD$160))","v":15},{"$f":"SUM((K$21=Individual!$AA$8:$AA$160)*(Overview!$G25=Individual!$AD$8:$AD$160))","v":13},{"$f":"SUM((L$21=Individual!$AA$8:$AA$160)*(Overview!$G25=Individual!$AD$8:$AD$160))","v":16},{"$f":"SUM((M$21=Individual!$AA$8:$AA$160)*(Overview!$G25=Individual!$AD$8:$AD$160))","v":5}]
[{"$nulls":6},"F SV",{"$f":"COUNTIF(Individual!$AD$7:$AD$160,Overview!G26)","v":6},null,{"$f":"SUM((J$21=Individual!$AA$8:$AA$160)*(Overview!$G26=Individual!$AD$8:$AD$160))","v":1},{"$f":"SUM((K$21=Individual!$AA$8:$AA$160)*(Overview!$G26=Individual!$AD$8:$AD$160))","v":2},{"$f":"SUM((L$21=Individual!$AA$8:$AA$160)*(Overview!$G26=Individual!$AD$8:$AD$160))","v":1},{"$f":"SUM((M$21=Individual!$AA$8:$AA$160)*(Overview!$G26=Individual!$AD$8:$AD$160))","v":2}]
[{"$nulls":6},"M SV",{"$f":"COUNTIF(Individual!$AD$7:$AD$160,Overview!G27)","v":21},null,{"$f":"SUM((J$21=Individual!$AA$8:$AA$160)*(Overview!$G27=Individual!$AD$8:$AD$160))","v":2},{"$f":"SUM((K$21=Individual!$AA$8:$AA$160)*(Overview!$G27=Individual!$AD$8:$AD$160))","v":9},{"$f":"SUM((L$21=Individual!$AA$8:$AA$160)*(Overview!$G27=Individual!$AD$8:$AD$160))","v":6},{"$f":"SUM((M$21=Individual!$AA$8:$AA$160)*(Overview!$G27=Individual!$AD$8:$AD$160))","v":4}]
[]
[{"$nulls":3},"Total",{"$f":"SUM(E22:E28)","v":153},null,null,{"$f":"SUM(H22:H28)","v":153},null,{"$f":"SUM(J22:J28)","v":44},{"$f":"SUM(K22:K28)","v":36},50,23]

{"sheet":"Individual","index":1,"n_rows":160,"n_cols":32,"rows_kept":160,"merged":[[1,1,1,23]]}
[]
[null,"Individual results by age/gender category from the 2020 Virtual Blackcap race in memory of Chris Smith"]
[null,2,3,1]
[]
[]
[null,"M S",{"$nulls":3},"M V",{"$nulls":3},"M SV",{"$nulls":3},"F S",{"$nulls":3},"F V",{"$nulls":3},"F SV"]
[null,"runner","time","Club",null,"runner","time","Club",null,"runner","time","Club",null,"runner","time","Club",null,"runner","time","Club",null,"runner","time","Club",null,"time rank","club","runner","time","cat","cat rank"]
[1,{"$f":"INDEX($AA$8:$AE$160,MATCH(1,($A8=$AE$8:$AE$160)*($B$6=$AD$8:$AD$160),0),$B$3)","v":"Ben Gibson"},{"$f":"INDEX($AA$8:$AE$160,MATCH(1,($A8=$AE$8:$AE$160)*($B$6=$AD$8:$AD$160),0),$C$3)","v":"00:29:18"},{"$f":"INDEX($AA$8:$AE$160,MATCH(1,($A8=$AE$8:$AE$160)*($B$6=$AD$8:$AD$160),0),$D$3)","v":"HHH"},null,{"$f":"INDEX($AA$8:$AE$160,MATCH(1,($A8=$AE$8:$AE$160)*($F$6=$AD$8:$AD$160),0),$B$3)","v":"Chris Gilbert"},{"$f":"INDEX($AA$8:$AE$160,MATCH(1,($A8=$AE$8:$AE$160)*($F$6=$AD$8:$AD$160),0),$C$3)","v":"00:31:16"},{"$f":"INDEX($AA$8:$AE$160,MATCH(1,($A8=$AE$8:$AE$160)*($F$6=$AD$8:$AD$160),0),$D$3)","v":"Lewes"},null,{"$f":"INDEX($AA$8:$AE$160,MATCH(1,($A8=$AE$8:$AE$160)*($J$6=$AD$8:$AD$160),0),$B$3)","v":"Paul Whelpton "},{"$f":"INDEX($AA$8:$AE$160,MATCH(1,($A8=$AE$8:$AE$160)*($J$6=$AD$8:$AD$160),0),$C$3)","v":"00:34:40"},{"$f":"INDEX($AA$8:$AE$160,MATCH(1,($A8=$AE$8:$AE$160)*($J$6=$AD$8:$AD$160),0),$D$3)","v":"PHX"},1,{"$f":"INDEX($AA$8:$AE$160,MATCH(1,($A8=$AE$8:$AE$160)*($N$6=$AD$8:$AD$160),0),$B$3)","v":"Bobby Searle "},{"$f":"INDEX($AA$8:$AE$160,MATCH(1,($A8=$AE$8:$AE$160)*($N$6=$AD$8:$AD$160),0),$C$3)","v":"00:34:23"},{"$f":"INDEX($AA$8:$AE$160,MATCH(1,($A8=$AE$8:$AE$160)*($N$6=$AD$8:$AD$160),0),$D$3)","v":"PHX"},null,{"$f":"INDEX($AA$8:$AE$160,MATCH(1,($A8=$AE$8:$AE$160)*($R$6=$AD$8:$AD$160),0),$B$3)","v":"Samantha Leader "},{"$f":"INDEX($AA$8:$AE$160,MATCH(1,($A8=$AE$8:$AE$160)*($R$6=$AD$8:$AD$160),0),$C$3)","v":"00:37:03"},{"$f":"INDEX($AA$8:$AE$160,MATCH(1,($A8=$AE$8:$AE$160)*($R$6=$AD$8:$AD$160),0),$D$3)","v":"PHX"},null,{"$f":"INDEX($AA$8:$AE$160,MATCH(1,($A8=$AE$8:$AE$160)*($V$6=$AD$8:$AD$160),0),$B$3)","v":"Marion Hemsworth"},{"$f":"INDEX($AA$8:$AE$160,MATCH(1,($A8=$AE$8:$AE$160)*($V$6=$AD$8:$AD$160),0),$C$3)","v":"00:48:20"},{"$f":"INDEX($AA$8:$AE$160,MATCH(1,($A8=$AE$8:$AE$160)*($V$6=$AD$8:$AD$160),0),$D$3)","v":"HHH"},null,1,"HHH",{"$f":"HHH!D7","v":"Ben Gibson"},{"$f":"HHH!E7","v":"00:29:18"},{"$f":"HHH!H7","v":"M S"},{"$f":"COUNTIFS($AD$8:$AD$160,AD8,$AC$8:$AC$160,\"<\"&AC8)+1","v":1}]
[2,{"$f":"INDEX($AA$8:$AE$160,MATCH(1,($A9=$AE$8:$AE$160)*($B$6=$AD$8:$AD$160),0),$B$3)","v":"Simon Heath "},{"$f":"INDEX($AA$8:$AE$160,MATCH(1,($A9=$AE$8:$AE$160)*($B$6=$AD$8:$AD$160),0),$C$3)","v":"00:29:37"},{"$f":"INDEX($AA$8:$AE$160,MATCH(1,($A9=$AE$8:$AE$160)*($B$6=$AD$8:$AD$160),0),$D$3)","v":"PHX"},null,{"$f":"INDEX($AA$8:$AE$160,MATCH(1,($A9=$AE$8:$AE$160)*($F$6=$AD$8:$AD$160),0),$B$3)","v":"Mike Ellicock"},{"$f":"INDEX($AA$8:$AE$160,MATCH(1,($A9=$AE$8:$AE$160)*($F$6=$AD$8:$AD$160),0),$C$3)","v":"00:31:26"},{"$f":"INDEX($AA$8:$AE$160,MATCH(1,($A9=$AE$8:$AE$160)*($F$6=$AD$8:$AD$160),0),$D$3)","v":"Lewes"},null,{"$f":"INDEX($AA$8:$AE$160,MATCH(1,($A9=$AE$8:$AE$160)*($J$6=$AD$8:$AD$160),0),$B$3)","v":"Tim Hicks"},{"$f":"INDEX($AA$8:$AE$160,MATCH(1,($A9=$AE$8:$AE$160)*($J$6=$AD$8:$AD$160),0),$C$3)","v":"00:38:11"},{"$f":"INDEX($AA$8:$AE$160,MATCH(1,($A9=$AE$8:$AE$160)*($J$6=$AD$8:$AD$160),0),$D$3)","v":"HHH"},2,{"$f":"INDEX($AA$8:$AE$160,MATCH(1,($A9=$AE$8:$AE$160)*($N$6=$AD$8:$AD$160),0),$B$3)","v":"Erica Martin "},{"$f":"INDEX($AA$8:$AE$160,MATCH(1,($A9=$AE$8:$AE$160)*($N$6=$AD$8:$AD$160),0),$C$3)","v":"00:36:06"},{"$f":"INDEX($AA$8:$AE$160,MATCH(1,($A9=$AE$8:$AE$160)*($N$6=$AD$8:$AD$160),0),$D$3)","v":"PHX"},null,{"$f":"INDEX($AA$8:$AE$160,MATCH(1,($A9=$AE$8:$AE$160)*($R$6=$AD$8:$AD$160),0),$B$3)","v":"Helen Sida"},{"$f":"INDEX($AA$8:$AE$160,MATCH(1,($A9=$AE$8:$AE$160)*($R$6=$AD$8:$AD$160),0),$C$3)","v":"00:37:39"},{"$f":"INDEX($AA$8:$AE$160,MATCH(1,($A9=$AE$8:$AE$160)*($R$6=$AD$8:$AD$160),0),$D$3)","v":"Lewes"},null,{"$f":"INDEX($AA$8:$AE$160,MATCH(1,($A9=$AE$8:$AE$160)*($V$6=$AD$8:$AD$160),0),$B$3)","v":"Anne Hagan"},{"$f":"INDEX($AA$8:$AE$160,MATCH(1,($A9=$AE$8:$AE$160)*($V$6=$AD$8:$AD$160),0),$C$3)","v":"00:49:24"},{"$f":"INDEX($AA$8:$AE$160,MATCH(1,($A9=$AE$8:$AE$160)*($V$6=$AD$8:$AD$160),0),$D$3)","v":"Lewes"},null,2,"PHX",{"$f":"Phoenix!D7","v":"Simon Heath "},{"$f":"Phoenix!E7","v":"00:29:37"},{"$f":"Phoenix!H7","v":"M S"},2]
[3,{"$f":"INDEX($AA$8:$AE$160,MATCH(1,($A10=$AE$8:$AE$160)*($B$6=$AD$8:$AD$160),0),$B$3)","v":"James Collins"},{"$f":"INDEX($AA$8:$AE$160,MATCH(1,($A10=$AE$8:$AE$160)*($B$6=$AD$8:$AD$160),0),$C$3)","v":"00:29:46"},{"$f":"INDEX($AA$8:$AE$160,MATCH(1,($A10=$AE$8:$AE$160)*($B$6=$AD$8:$AD$160),0),$D$3)","v":"HHH"},null,{"$f":"INDEX($AA$8:$AE$160,MATCH(1,($A10=$AE$8:$AE$160)*($F$6=$AD$8:$AD$160),0),$B$3)","v":"Marcus Kimmins"},{"$f":"INDEX($AA$8:$AE$160,MATCH(1,($A10=$AE$8:$AE$160)*($F$6=$AD$8:$AD$160),0),$C$3)","v":"00:31:26.010"},{"$f":"INDEX($AA$8:$AE$160,MATCH(1,($A10=$AE$8:$AE$160)*($F$6=$AD$8:$AD$160),0),$D$3)","v":"HHH"},null,{"$f":"INDEX($AA$8:$AE$160,MATCH(1,($A10=$AE$8:$AE$160)*($J$6=$AD$8:$AD$160),0),$B$3)","v":"David Prince-Iles"},{"$f":"INDEX($AA$8:$AE$160,MATCH(1,($A10=$AE$8:$AE$160)*($J$6=$AD$8:$AD$160),0),$C$3)","v":"00:38:27"},{"$f":"INDEX($AA$8:$AE$160,MATCH(1,($A10=$AE$8:$AE$160)*($J$6=$AD$8:$AD$160),0),$D$3)","v":"Lewes"},3,{"$f":"INDEX($AA$8:$AE$160,MATCH(1,($A10=$AE$8:$AE$160)*($N$6=$AD$8:$AD$160),0),$B$3)","v":"Cat Bounds "},{"$f":"INDEX($AA$8:$AE$160,MATCH(1,($A10=$AE$8:$AE$160)*($N$6=$AD$8:$AD$160),0),$C$3)","v":"00:37:22"},{"$f":"INDEX($AA$8:$AE$160,MATCH(1,($A10=$AE$8:$AE$160)*($N$6=$AD$8:$AD$160),0),$D$3)","v":"PHX"},null,{"$f":"INDEX($AA$8:$AE$160,MATCH(1,($A10=$AE$8:$AE$160)*($R$6=$AD$8:$AD$160),0),$B$3)","v":"Siobhan Amer"},{"$f":"INDEX($AA$8:$AE$160,MATCH(1,($A10=$AE$8:$AE$160)*($R$6=$AD$8:$AD$160),0),$C$3)","v":"00:38:16"},{"$f":"INDEX($AA$8:$AE$160,MATCH(1,($A10=$AE$8:$AE$160)*($R$6=$AD$8:$AD$160),0),$D$3)","v":"HHH"},null,{"$f":"INDEX($AA$8:$AE$160,MATCH(1,($A10=$AE$8:$AE$160)*($V$6=$AD$8:$AD$160),0),$B$3)","v":"Nicky Callus"},{"$f":"INDEX($AA$8:$AE$160,MATCH(1,($A10=$AE$8:$AE$160)*($V$6=$AD$8:$AD$160),0),$C$3)","v":"00:49:35"},{"$f":"INDEX($AA$8:$AE$160,MATCH(1,($A10=$AE$8:$AE$160)*($V$6=$AD$8:$AD$160),0),$D$3)","v":"BHR"},null,3,"HHH",{"$f":"HHH!D8","v":"James Collins"},{"$f":"HHH!E8","v":"00:29:46"},{"$f":"HHH!H8","v":"M S"},3]
[4,{"$f":"INDEX($AA$8:$AE$160,MATCH(1,($A11=$AE$8:$AE$160)*($B$6=$AD$8:$AD$160),0),$B$3)","v":"Todd Leckie "},{"$f":"INDEX($AA$8:$AE$160,MATCH(1,($A11=$AE$8:$AE$160)*($B$6=$AD$8:$AD$160),0),$C$3)","v":"00:30:17"},{"$f":"INDEX($AA$8:$AE$160,MATCH(1,($A11=$AE$8:$AE$160)*($B$6=$AD$8:$AD$160),0),$D$3)","v":"PHX"},null,{"$f":"INDEX($AA$8:$AE$160,MATCH(1,($A11=$AE$8:$AE$160)*($F$6=$AD$8:$AD$160),0),$B$3)","v":"Lewis Sida"},{"$f":"INDEX($AA$8:$AE$160,MATCH(1,($A11=$AE$8:$AE$160)*($F$6=$AD$8:$AD$160),0),$C$3)","v":"00:31:41"},{"$f":"INDEX($AA$8:$AE$160,MATCH(1,($A11=$AE$8:$AE$160)*($F$6=$AD$8:$AD$160),0),$D$3)","v":"Lewes"},null,{"$f":"INDEX($AA$8:$AE$160,MATCH(1,($A11=$AE$8:$AE$160)*($J$6=$AD$8:$AD$160),0),$B$3)","v":"Dan Allen "},{"$f":"INDEX($AA$8:$AE$160,MATCH(1,($A11=$AE$8:$AE$160)*($J$6=$AD$8:$AD$160),0),$C$3)","v":"00:40:00"},{"$f":"INDEX($AA$8:$AE$160,MATCH(1,($A11=$AE$8:$AE$160)*($J$6=$AD$8:$AD$160),0),$D$3)","v":"PHX"},4,{"$f":"INDEX($AA$8:$AE$160,MATCH(1,($A11=$AE$8:$AE$160)*($N$6=$AD$8:$AD$160),0),$B$3)","v":"Kim Lo"},{"$f":"INDEX($AA$8:$AE$160,MATCH(1,($A11=$AE$8:$AE$160)*($N$6=$AD$8:$AD$160),0),$C$3)","v":"00:38:08"},{"$f":"INDEX($AA$8:$AE$160,MATCH(1,($A11=$AE$8:$AE$160)*($N$6=$AD$8:$AD$160),0),$D$3)","v":"HHH"},null,{"$f":"INDEX($AA$8:$AE$160,MATCH(1,($A11=$AE$8:$AE$160)*($R$6=$AD$8:$AD$160),0),$B$3)","v":"Sara Burns "},{"$f":"INDEX($AA$8:$AE$160,MATCH(1,($A11=$AE$8:$AE$160)*($R$6=$AD$8:$AD$160),0),$C$3)","v":"00:38:29"},{"$f":"INDEX($AA$8:$AE$160,MATCH(1,($A11=$AE$8:$AE$160)*($R$6=$AD$8:$AD$160),0),$D$3)","v":"PHX"},null,{"$f":"INDEX($AA$8:$AE$160,MATCH(1,($A11=$AE$8:$AE$160)*($V$6=$AD$8:$AD$160),0),$B$3)","v":"Jude Matthews "},{"$f":"INDEX($AA$8:$AE$160,MATCH(1,($A11=$AE$8:$AE$160)*($V$6=$AD$8:$AD$160),0),$C$3)","v":"00:49:49"},{"$f":"INDEX($AA$8:$AE$160,MATCH(1,($A11=$AE$8:$AE$160)*($V$6=$AD$8:$AD$160),0),$D$3)","v":"PHX"},null,4,"PHX",{"$f":"Phoenix!D8","v":"Todd Leckie "},{"$f":"Phoenix!E8","v":"00:30:17"},{"$f":"Phoenix!H8","v":"M S"},4]
[5,{"$f":"INDEX($AA$8:$AE$160,MATCH(1,($A12=$AE$8:$AE$160)*($B$6=$AD$8:$AD$160),0),$B$3)","v":"Jon Clays "},{"$f":"INDEX($AA$8:$AE$160,MATCH(1,($A12=$AE$8:$AE$160)*($B$6=$AD$8:$AD$160),0),$C$3)","v":"00:30:21"},{"$f":"INDEX($AA$8:$AE$160,MATCH(1,($A12=$AE$8:$AE$160)*($B$6=$AD$8:$AD$160),0),$D$3)","v":"PHX"},null,{"$f":"INDEX($AA$8:$AE$160,MATCH(1,($A12=$AE$8:$AE$160)*($F$6=$AD$8:$AD$160),0),$B$3)","v":"Stuart Roberts "},{"$f":"INDEX($AA$8:$AE$160,MATCH(1,($A12=$AE$8:$AE$160)*($F$6=$AD$8:$AD$160),0),$C$3)","v":"00:32:21"},{"$f":"INDEX($AA$8:$AE$160,MATCH(1,($A12=$AE$8:$AE$160)*($F$6=$AD$8:$AD$160),0),$D$3)","v":"PHX"},null,{"$f":"INDEX($AA$8:$AE$160,MATCH(1,($A12=$AE$8:$AE$160)*($J$6=$AD$8:$AD$160),0),$B$3)","v":"Gerard Dummett "},{"$f":"INDEX($AA$8:$AE$160,MATCH(1,($A12=$AE$8:$AE$160)*($J$6=$AD$8:$AD$160),0),$C$3)","v":"00:42:37"},{"$f":"INDEX($AA$8:$AE$160,MATCH(1,($A12=$AE$8:$AE$160)*($J$6=$AD$8:$AD$160),0),$D$3)","v":"Lewes"},5,{"$f":"INDEX($AA$8:$AE$160,MATCH(1,($A12=$AE$8:$AE$160)*($N$6=$AD$8:$AD$160),0),$B$3)","v":"Sibel Recber "},{"$f":"INDEX($AA$8:$AE$160,MATCH(1,($A12=$AE$8:$AE$160)*($N$6=$AD$8:$AD$160),0),$C$3)","v":"00:38:22"},{"$f":"INDEX($AA$8:$AE$160,MATCH(1,($A12=$AE$8:$AE$160)*($N$6=$AD$8:$AD$160),0),$D$3)","v":"PHX"},null,{"$f":"INDEX($AA$8:$AE$160,MATCH(1,($A12=$AE$8:$AE$160)*($R$6=$AD$8:$AD$160),0),$B$3)","v":"Amelia Culshaw "},{"$f":"INDEX($AA$8:$AE$160,MATCH(1,($A12=$AE$8:$AE$160)*($R$6=$AD$8:$AD$160),0),$C$3)","v":"00:41:10"},{"$f":"INDEX($AA$8:$AE$160,MATCH(1,($A12=$AE$8:$AE$160)*($R$6=$AD$8:$AD$160),0),$D$3)","v":"PHX"},null,{"$f":"INDEX($AA$8:$AE$160,MATCH(1,($A12=$AE$8:$AE$160)*($V$6=$AD$8:$AD$160),0),$B$3)","v":"Anita Amies"},{"$f":"INDEX($AA$8:$AE$160,MATCH(1,($A12=$AE$8:$AE$160)*($V$6=$AD$8:$AD$160),0),$C$3)","v":"00:50:13"},{"$f":"INDEX($AA$8:$AE$160,MATCH(1,($A12=$AE$8:$AE$160)*($V$6=$AD$8:$AD$160),0),$D$3)","v":"Lewes"},null,5,"PHX",{"$f":"Phoenix!D9","v":"Jon Clays "},{"$f":"Phoenix!E9","v":"00:30:21"},{"$f":"Phoenix!H9","v":"M S"},5]
[6,{"$f":"INDEX($AA$8:$AE$160,MATCH(1,($A13=$AE$8:$AE$160)*($B$6=$AD$8:$AD$160),0),$B$3)","v":"Jim Lathbury "},{"$f":"INDEX($AA$8:$AE$160,MATCH(1,($A13=$AE$8:$AE$160)*($B$6=$AD$8:$AD$160),0),$C$3)","v":"00:30:24"},{"$f":"INDEX($AA$8:$AE$160,MATCH(1,($A13=$AE$8:$AE$160)*($B$6=$AD$8:$AD$160),0),$D$3)","v":"PHX"},null,{"$f":"INDEX($AA$8:$AE$160,MATCH(1,($A13=$AE$8:$AE$160)*($F$6=$AD$8:$AD$160),0),$B$3)","v":"Andy Hind"},{"$f":"INDEX($AA$8:$AE$160,MATCH(1,($A13=$AE$8:$AE$160)*($F$6=$AD$8:$AD$160),0),$C$3)","v":"00:32:26"},{"$f":"INDEX($AA$8:$AE$160,MATCH(1,($A13=$AE$8:$AE$160)*($F$6=$AD$8:$AD$160),0),$D$3)","v":"HHH"},null,{"$f":"INDEX($AA$8:$AE$160,MATCH(1,($A13=$AE$8:$AE$160)*($J$6=$AD$8:$AD$160),0),$B$3)","v":"Stuart Condie"},{"$f":"INDEX($AA$8:$AE$160,MATCH(1,($A13=$AE$8:$AE$160)*($J$6=$AD$8:$AD$160),0),$C$3)","v":"00:43:10"},{"$f":"INDEX($AA$8:$AE$160,MATCH(1,($A13=$AE$8:$AE$160)*($J$6=$AD$8:$AD$160),0),$D$3)","v":"BHR"},6,{"$f":"INDEX($AA$8:$AE$160,MATCH(1,($A13=$AE$8:$AE$160)*($N$6=$AD$8:$AD$160),0),$B$3)","v":"Emily Budd "},{"$f":"INDEX($AA$8:$AE$160,MATCH(1,($A13=$AE$8:$AE$160)*($N$6=$AD$8:$AD$160),0),$C$3)","v":"00:38:37"},{"$f":"INDEX($AA$8:$AE$160,MATCH(1,($A13=$AE$8:$AE$160)*($N$6=$AD$8:$AD$160),0),$D$3)","v":"PHX"},null,{"$f":"INDEX($AA$8:$AE$160,MATCH(1,($A13=$AE$8:$AE$160)*($R$6=$AD$8:$AD$160),0),$B$3)","v":"Katherine Buckeridge"},{"$f":"INDEX($AA$8:$AE$160,MATCH(1,($A13=$AE$8:$AE$160)*($R$6=$AD$8:$AD$160),0),$C$3)","v":"00:42:45"},{"$f":"INDEX($AA$8:$AE$160,MATCH(1,($A13=$AE$8:$AE$160)*($R$6=$AD$8:$AD$160),0),$D$3)","v":"HHH"},null,{"$f":"INDEX($AA$8:$AE$160,MATCH(1,($A13=$AE$8:$AE$160)*($V$6=$AD$8:$AD$160),0),$B$3)","v":"Kim Gow"},{"$f":"INDEX($AA$8:$AE$160,MATCH(1,($A13=$AE$8:$AE$160)*($V$6=$AD$8:$AD$160),0),$C$3)","v":"00:52:53"},{"$f":"INDEX($AA$8:$AE$160,MATCH(1,($A13=$AE$8:$AE$160)*($V$6=$AD$8:$AD$160),0),$D$3)","v":"BHR"},null,6,"PHX",{"$f":"Phoenix!D10","v":"Jim Lathbury "},{"$f":"Phoenix!E10","v":"00:30:24"},{"$f":"Phoenix!H10","v":"M S"},6]
[7,{"$f":"INDEX($AA$8:$AE$160,MATCH(1,($A14=$AE$8:$AE$160)*($B$6=$AD$8:$AD$160),0),$B$3)","v":"Alex Garrod "},{"$f":"INDEX($AA$8:$AE$160,MATCH(1,($A14=$AE$8:$AE$160)*($B$6=$AD$8:$AD$160),0),$C$3)","v":"00:31:05"},{"$f":"INDEX($AA$8:$AE$160,MATCH(1,($A14=$AE$8:$AE$160)*($B$6=$AD$8:$AD$160),0),$D$3)","v":"PHX"},null,{"$f":"INDEX($AA$8:$AE$160,MATCH(1,($A14=$AE$8:$AE$160)*($F$6=$AD$8:$AD$160),0),$B$3)","v":"James Moffat"},{"$f":"INDEX($AA$8:$AE$160,MATCH(1,($A14=$AE$8:$AE$160)*($F$6=$AD$8:$AD$160),0),$C$3)","v":"00:32:36"},{"$f":"INDEX($AA$8:$AE$160,MATCH(1,($A14=$AE$8:$AE$160)*($F$6=$AD$8:$AD$160),0),$D$3)","v":"HHH"},null,{"$f":"INDEX($AA$8:$AE$160,MATCH(1,($A14=$AE$8:$AE$160)*($J$6=$AD$8:$AD$160),0),$B$3)","v":"Mark Sykes"},{"$f":"INDEX($AA$8:$AE$160,MATCH(1,($A14=$AE$8:$AE$160)*($J$6=$AD$8:$AD$160),0),$C$3)","v":"00:43:26"},{"$f":"INDEX($AA$8:$AE$160,MATCH(1,($A14=$AE$8:$AE$160)*($J$6=$AD$8:$AD$160),0),$D$3)","v":"HHH"},7,{"$f":"INDEX($AA$8:$AE$160,MATCH(1,($A14=$AE$8:$AE$160)*($N$6=$AD$8:$AD$160),0),$B$3)","v":"Chelsey Hallam "},{"$f":"INDEX($AA$8:$AE$160,MATCH(1,($A14=$AE$8:$AE$160)*($N$6=$AD$8:$AD$160),0),$C$3)","v":"00:39:36"},{"$f":"INDEX($AA$8:$AE$160,MATCH(1,($A14=$AE$8:$AE$160)*($N$6=$AD$8:$AD$160),0),$D$3)","v":"PHX"},null,{"$f":"INDEX($AA$8:$AE$160,MATCH(1,($A14=$AE$8:$AE$160)*($R$6=$AD$8:$AD$160),0),$B$3)","v":"Liz Halliday "},{"$f":"INDEX($AA$8:$AE$160,MATCH(1,($A14=$AE$8:$AE$160)*($R$6=$AD$8:$AD$160),0),$C$3)","v":"00:42:56"},{"$f":"INDEX($AA$8:$AE$160,MATCH(1,($A14=$AE$8:$AE$160)*($R$6=$AD$8:$AD$160),0),$D$3)","v":"PHX"},null,{"$f":"INDEX($AA$8:$AE$160,MATCH(1,($A14=$AE$8:$AE$160)*($V$6=$AD$8:$AD$160),0),$B$3)","v":{"$error":"#N/A"}},{"$f":"INDEX($AA$8:$AE$160,MATCH(1,($A14=$AE$8:$AE$160)*($V$6=$AD$8:$AD$160),0),$C$3)","v":{"$error":"#N/A"}},{"$f":"INDEX($AA$8:$AE$160,MATCH(1,($A14=$AE$8:$AE$160)*($V$6=$AD$8:$AD$160),0),$D$3)","v":{"$error":"#N/A"}},null,7,"PHX",{"$f":"Phoenix!D11","v":"Alex Garrod "},{"$f":"Phoenix!E11","v":"00:31:05"},{"$f":"Phoenix!H11","v":"M S"},7]
[8,{"$f":"INDEX($AA$8:$AE$160,MATCH(1,($A15=$AE$8:$AE$160)*($B$6=$AD$8:$AD$160),0),$B$3)","v":"Owen Wallek"},{"$f":"INDEX($AA$8:$AE$160,MATCH(1,($A15=$AE$8:$AE$160)*($B$6=$AD$8:$AD$160),0),$C$3)","v":"00:31:50"},{"$f":"INDEX($AA$8:$AE$160,MATCH(1,($A15=$AE$8:$AE$160)*($B$6=$AD$8:$AD$160),0),$D$3)","v":"BHR"},null,{"$f":"INDEX($AA$8:$AE$160,MATCH(1,($A15=$AE$8:$AE$160)*($F$6=$AD$8:$AD$160),0),$B$3)","v":"Mike Green "},{"$f":"INDEX($AA$8:$AE$160,MATCH(1,($A15=$AE$8:$AE$160)*($F$6=$AD$8:$AD$160),0),$C$3)","v":"00:32:38"},{"$f":"INDEX($AA$8:$AE$160,MATCH(1,($A15=$AE$8:$AE$160)*($F$6=$AD$8:$AD$160),0),$D$3)","v":"Lewes"},null,{"$f":"INDEX($AA$8:$AE$160,MATCH(1,($A15=$AE$8:$AE$160)*($J$6=$AD$8:$AD$160),0),$B$3)","v":"Peter Kennedy"},{"$f":"INDEX($AA$8:$AE$160,MATCH(1,($A15=$AE$8:$AE$160)*($J$6=$AD$8:$AD$160),0),$C$3)","v":"00:43:32"},{"$f":"INDEX($AA$8:$AE$160,MATCH(1,($A15=$AE$8:$AE$160)*($J$6=$AD$8:$AD$160),0),$D$3)","v":"Lewes"},8,{"$f":"INDEX($AA$8:$AE$160,MATCH(1,($A15=$AE$8:$AE$160)*($N$6=$AD$8:$AD$160),0),$B$3)","v":"Ellen Brookes"},{"$f":"INDEX($AA$8:$AE$160,MATCH(1,($A15=$AE$8:$AE$160)*($N$6=$AD$8:$AD$160),0),$C$3)","v":"00:39:39"},{"$f":"INDEX($AA$8:$AE$160,MATCH(1,($A15=$AE$8:$AE$160)*($N$6=$AD$8:$AD$160),0),$D$3)","v":"Lewes"},null,{"$f":"INDEX($AA$8:$AE$160,MATCH(1,($A15=$AE$8:$AE$160)*($R$6=$AD$8:$AD$160),0),$B$3)","v":"Helen Bowman"},{"$f":"INDEX($AA$8:$AE$160,MATCH(1,($A15=$AE$8:$AE$160)*($R$6=$AD$8:$AD$160),0),$C$3)","v":"00:45:37"},{"$f":"INDEX($AA$8:$AE$160,MATCH(1,($A15=$AE$8:$AE$160)*($R$6=$AD$8:$AD$160),0),$D$3)","v":"Lewes"},null,{"$f":"INDEX($AA$8:$AE$160,MATCH(1,($A15=$AE$8:$AE$160)*($V$6=$AD$8:$AD$160),0),$B$3)","v":{"$error":"#N/A"}},{"$f":"INDEX($AA$8:$AE$160,MATCH(1,($A15=$AE$8:$AE$160)*($V$6=$AD$8:$AD$160),0),$C$3)","v":{"$error":"#N/A"}},{"$f":"INDEX($AA$8:$AE$160,MATCH(1,($A15=$AE$8:$AE$160)*($V$6=$AD$8:$AD$160),0),$D$3)","v":{"$error":"#N/A"}},null,8,"Lewes",{"$f":"LewesAC!D7","v":"Chris Gilbert"},{"$f":"LewesAC!E7","v":"00:31:16"},{"$f":"LewesAC!H7","v":"M V"},1]
[9,{"$f":"INDEX($AA$8:$AE$160,MATCH(1,($A16=$AE$8:$AE$160)*($B$6=$AD$8:$AD$160),0),$B$3)","v":"Phil Payne"},{"$f":"INDEX($AA$8:$AE$160,MATCH(1,($A16=$AE$8:$AE$160)*($B$6=$AD$8:$AD$160),0),$C$3)","v":"00:32:24"},{"$f":"INDEX($AA$8:$AE$160,MATCH(1,($A16=$AE$8:$AE$160)*($B$6=$AD$8:$AD$160),0),$D$3)","v":"HHH"},null,{"$f":"INDEX($AA$8:$AE$160,MATCH(1,($A16=$AE$8:$AE$160)*($F$6=$AD$8:$AD$160),0),$B$3)","v":"Matt Greenall "},{"$f":"INDEX($AA$8:$AE$160,MATCH(1,($A16=$AE$8:$AE$160)*($F$6=$AD$8:$AD$160),0),$C$3)","v":"00:33:47"},{"$f":"INDEX($AA$8:$AE$160,MATCH(1,($A16=$AE$8:$AE$160)*($F$6=$AD$8:$AD$160),0),$D$3)","v":"PHX"},null,{"$f":"INDEX($AA$8:$AE$160,MATCH(1,($A16=$AE$8:$AE$160)*($J$6=$AD$8:$AD$160),0),$B$3)","v":"Ian Hilder"},{"$f":"INDEX($AA$8:$AE$160,MATCH(1,($A16=$AE$8:$AE$160)*($J$6=$AD$8:$AD$160),0),$C$3)","v":"00:44:13"},{"$f":"INDEX($AA$8:$AE$160,MATCH(1,($A16=$AE$8:$AE$160)*($J$6=$AD$8:$AD$160),0),$D$3)","v":"Lewes"},9,{"$f":"INDEX($AA$8:$AE$160,MATCH(1,($A16=$AE$8:$AE$160)*($N$6=$AD$8:$AD$160),0),$B$3)","v":"Tamsyn d'Arienzo"},{"$f":"INDEX($AA$8:$AE$160,MATCH(1,($A16=$AE$8:$AE$160)*($N$6=$AD$8:$AD$160),0),$C$3)","v":"00:39:45"},{"$f":"INDEX($AA$8:$AE$160,MATCH(1,($A16=$AE$8:$AE$160)*($N$6=$AD$8:$AD$160),0),$D$3)","v":"Lewes"},null,{"$f":"INDEX($AA$8:$AE$160,MATCH(1,($A16=$AE$8:$AE$160)*($R$6=$AD$8:$AD$160),0),$B$3)","v":"Shelagh Robinson"},{"$f":"INDEX($AA$8:$AE$160,MATCH(1,($A16=$AE$8:$AE$160)*($R$6=$AD$8:$AD$160),0),$C$3)","v":"00:45:40"},{"$f":"INDEX($AA$8:$AE$160,MATCH(1,($A16=$AE$8:$AE$160)*($R$6=$AD$8:$AD$160),0),$D$3)","v":"HHH"},null,{"$f":"INDEX($AA$8:$AE$160,MATCH(1,($A16=$AE$8:$AE$160)*($V$6=$AD$8:$AD$160),0),$B$3)","v":{"$error":"#N/A"}},{"$f":"INDEX($AA$8:$AE$160,MATCH(1,($A16=$AE$8:$AE$160)*($V$6=$AD$8:$AD$160),0),$C$3)","v":{"$error":"#N/A"}},{"$f":"INDEX($AA$8:$AE$160,MATCH(1,($A16=$AE$8:$AE$160)*($V$6=$AD$8:$AD$160),0),$D$3)","v":{"$error":"#N/A"}},null,10,"Lewes",{"$f":"LewesAC!D8","v":"Mike Ellicock"},{"$f":"LewesAC!E8","v":"00:31:26"},{"$f":"LewesAC!H8","v":"M V"},2,"tied"]
[10,{"$f":"INDEX($AA$8:$AE$160,MATCH(1,($A17=$AE$8:$AE$160)*($B$6=$AD$8:$AD$160),0),$B$3)","v":"Paul Weir "},{"$f":"INDEX($AA$8:$AE$160,MATCH(1,($A17=$AE$8:$AE$160)*($B$6=$AD$8:$AD$160),0),$C$3)","v":"00:32:36"},{"$f":"INDEX($AA$8:$AE$160,MATCH(1,($A17=$AE$8:$AE$160)*($B$6=$AD$8:$AD$160),0),$D$3)","v":"PHX"},null,{"$f":"INDEX($AA$8:$AE$160,MATCH(1,($A17=$AE$8:$AE$160)*($F$6=$AD$8:$AD$160),0),$B$3)","v":"Tony Rickwood "},{"$f":"INDEX($AA$8:$AE$160,MATCH(1,($A17=$AE$8:$AE$160)*($F$6=$AD$8:$AD$160),0),$C$3)","v":"00:33:55"},{"$f":"INDEX($AA$8:$AE$160,MATCH(1,($A17=$AE$8:$AE$160)*($F$6=$AD$8:$AD$160),0),$D$3)","v":"PHX"},null,{"$f":"INDEX($AA$8:$AE$160,MATCH(1,($A17=$AE$8:$AE$160)*($J$6=$AD$8:$AD$160),0),$B$3)","v":"Andrew Haig "},{"$f":"INDEX($AA$8:$AE$160,MATCH(1,($A17=$AE$8:$AE$160)*($J$6=$AD$8:$AD$160),0),$C$3)","v":"00:44:16"},{"$f":"INDEX($AA$8:$AE$160,MATCH(1,($A17=$AE$8:$AE$160)*($J$6=$AD$8:$AD$160),0),$D$3)","v":"PHX"},10,{"$f":"INDEX($AA$8:$AE$160,MATCH(1,($A17=$AE$8:$AE$160)*($N$6=$AD$8:$AD$160),0),$B$3)","v":"Georgie Anderson "},{"$f":"INDEX($AA$8:$AE$160,MATCH(1,($A17=$AE$8:$AE$160)*($N$6=$AD$8:$AD$160),0),$C$3)","v":"00:39:59"},{"$f":"INDEX($AA$8:$AE$160,MATCH(1,($A17=$AE$8:$AE$160)*($N$6=$AD$8:$AD$160),0),$D$3)","v":"PHX"},null,{"$f":"INDEX($AA$8:$AE$160,MATCH(1,($A17=$AE$8:$AE$160)*($R$6=$AD$8:$AD$160),0),$B$3)","v":"Jacqueline Barnes"},{"$f":"INDEX($AA$8:$AE$160,MATCH(1,($A17=$AE$8:$AE$160)*($R$6=$AD$8:$AD$160),0),$C$3)","v":"00:46:47"},{"$f":"INDEX($AA$8:$AE$160,MATCH(1,($A17=$AE$8:$AE$160)*($R$6=$AD$8:$AD$160),0),$D$3)","v":"HHH"},null,{"$f":"INDEX($AA$8:$AE$160,MATCH(1,($A17=$AE$8:$AE$160)*($V$6=$AD$8:$AD$160),0),$B$3)","v":{"$error":"#N/A"}},{"$f":"INDEX($AA$8:$AE$160,MATCH(1,($A17=$AE$8:$AE$160)*($V$6=$AD$8:$AD$160),0),$C$3)","v":{"$error":"#N/A"}},{"$f":"INDEX($AA$8:$AE$160,MATCH(1,($A17=$AE$8:$AE$160)*($V$6=$AD$8:$AD$160),0),$D$3)","v":{"$error":"#N/A"}},null,9,"HHH",{"$f":"HHH!D9","v":"Marcus Kimmins"},{"$f":"HHH!E9","v":"00:31:26.010"},{"$f":"HHH!H9","v":"M V"},3,"tied"]
[11,{"$f":"INDEX($AA$8:$AE$160,MATCH(1,($A18=$AE$8:$AE$160)*($B$6=$AD$8:$AD$160),0),$B$3)","v":"Matt Cook"},{"$f":"INDEX($AA$8:$AE$160,MATCH(1,($A18=$AE$8:$AE$160)*($B$6=$AD$8:$AD$160),0),$C$3)","v":"00:32:45"},{"$f":"INDEX($AA$8:$AE$160,MATCH(1,($A18=$AE$8:$AE$160)*($B$6=$AD$8:$AD$160),0),$D$3)","v":"HHH"},null,{"$f":"INDEX($AA$8:$AE$160,MATCH(1,($A18=$AE$8:$AE$160)*($F$6=$AD$8:$AD$160),0),$B$3)","v":"Ben Hodgson"},{"$f":"INDEX($AA$8:$AE$160,MATCH(1,($A18=$AE$8:$AE$160)*($F$6=$AD$8:$AD$160),0),$C$3)","v":"00:33:57"},{"$f":"INDEX($AA$8:$AE$160,MATCH(1,($A18=$AE$8:$AE$160)*($F$6=$AD$8:$AD$160),0),$D$3)","v":"Lewes"},null,{"$f":"INDEX($AA$8:$AE$160,MATCH(1,($A18=$AE$8:$AE$160)*($J$6=$AD$8:$AD$160),0),$B$3)","v":"Richard Light"},{"$f":"INDEX($AA$8:$AE$160,MATCH(1,($A18=$AE$8:$AE$160)*($J$6=$AD$8:$AD$160),0),$C$3)","v":"00:45:25"},{"$f":"INDEX($AA$8:$AE$160,MATCH(1,($A18=$AE$8:$AE$160)*($J$6=$AD$8:$AD$160),0),$D$3)","v":"BHR"},11,{"$f":"INDEX($AA$8:$AE$160,MATCH(1,($A18=$AE$8:$AE$160)*($N$6=$AD$8:$AD$160),0),$B$3)","v":"Jess Stribbling "},{"$f":"INDEX($AA$8:$AE$160,MATCH(1,($A18=$AE$8:$AE$160)*($N$6=$AD$8:$AD$160),0),$C$3)","v":"00:40:05"},{"$f":"INDEX($AA$8:$AE$160,MATCH(1,($A18=$AE$8:$AE$160)*($N$6=$AD$8:$AD$160),0),$D$3)","v":"PHX"},null,{"$f":"INDEX($AA$8:$AE$160,MATCH(1,($A18=$AE$8:$AE$160)*($R$6=$AD$8:$AD$160),0),$B$3)","v":"Ruth Wray"},{"$f":"INDEX($AA$8:$AE$160,MATCH(1,($A18=$AE$8:$AE$160)*($R$6=$AD$8:$AD$160),0),$C$3)","v":"00:47:03"},{"$f":"INDEX($AA$8:$AE$160,MATCH(1,($A18=$AE$8:$AE$160)*($R$6=$AD$8:$AD$160),0),$D$3)","v":"Lewes"},{"$nulls":5},11,"Lewes",{"$f":"LewesAC!D9","v":"Lewis Sida"},{"$f":"LewesAC!E9","v":"00:31:41"},{"$f":"LewesAC!H9","v":"M V"},4]
[12,{"$f":"INDEX($AA$8:$AE$160,MATCH(1,($A19=$AE$8:$AE$160)*($B$6=$AD$8:$AD$160),0),$B$3)","v":"Ben Pepler"},{"$f":"INDEX($AA$8:$AE$160,MATCH(1,($A19=$AE$8:$AE$160)*($B$6=$AD$8:$AD$160),0),$C$3)","v":"00:32:49"},{"$f":"INDEX($AA$8:$AE$160,MATCH(1,($A19=$AE$8:$AE$160)*($B$6=$AD$8:$AD$160),0),$D$3)","v":"Lewes"},null,{"$f":"INDEX($AA$8:$AE$160,MATCH(1,($A19=$AE$8:$AE$160)*($F$6=$AD$8:$AD$160),0),$B$3)","v":"Rick Curtis"},{"$f":"INDEX($AA$8:$AE$160,MATCH(1,($A19=$AE$8:$AE$160)*($F$6=$AD$8:$AD$160),0),$C$3)","v":"00:34:00"},{"$f":"INDEX($AA$8:$AE$160,MATCH(1,($A19=$AE$8:$AE$160)*($F$6=$AD$8:$AD$160),0),$D$3)","v":"Lewes"},null,{"$f":"INDEX($AA$8:$AE$160,MATCH(1,($A19=$AE$8:$AE$160)*($J$6=$AD$8:$AD$160),0),$B$3)","v":"Mark Pappenheim"},{"$f":"INDEX($AA$8:$AE$160,MATCH(1,($A19=$AE$8:$AE$160)*($J$6=$AD$8:$AD$160),0),$C$3)","v":"00:46:30"},{"$f":"INDEX($AA$8:$AE$160,MATCH(1,($A19=$AE$8:$AE$160)*($J$6=$AD$8:$AD$160),0),$D$3)","v":"Lewes"},12,{"$f":"INDEX($AA$8:$AE$160,MATCH(1,($A19=$AE$8:$AE$160)*($N$6=$AD$8:$AD$160),0),$B$3)","v":"Rachel Gorman "},{"$f":"INDEX($AA$8:$AE$160,MATCH(1,($A19=$AE$8:$AE$160)*($N$6=$AD$8:$AD$160),0),$C$3)","v":"00:41:13"},{"$f":"INDEX($AA$8:$AE$160,MATCH(1,($A19=$AE$8:$AE$160)*($N$6=$AD$8:$AD$160),0),$D$3)","v":"PHX"},null,{"$f":"INDEX($AA$8:$AE$160,MATCH(1,($A19=$AE$8:$AE$160)*($R$6=$AD$8:$AD$160),0),$B$3)","v":"Lisa Ebdon "},{"$f":"INDEX($AA$8:$AE$160,MATCH(1,($A19=$AE$8:$AE$160)*($R$6=$AD$8:$AD$160),0),$C$3)","v":"00:47:31"},{"$f":"INDEX($AA$8:$AE$160,MATCH(1,($A19=$AE$8:$AE$160)*($R$6=$AD$8:$AD$160),0),$D$3)","v":"PHX"},{"$nulls":5},12,"BHR",{"$f":"BHR!D7","v":"Owen Wallek"},{"$f":"BHR!E7","v":"00:31:50"},{"$f":"BHR!H7","v":"M S"},8]
[13,{"$f":"INDEX($AA$8:$AE$160,MATCH(1,($A20=$AE$8:$AE$160)*($B$6=$AD$8:$AD$160),0),$B$3)","v":"Tom Clewley "},{"$f":"INDEX($AA$8:$AE$160,MATCH(1,($A20=$AE$8:$AE$160)*($B$6=$AD$8:$AD$160),0),$C$3)","v":"00:33:00"},{"$f":"INDEX($AA$8:$AE$160,MATCH(1,($A20=$AE$8:$AE$160)*($B$6=$AD$8:$AD$160),0),$D$3)","v":"PHX"},null,{"$f":"INDEX($AA$8:$AE$160,MATCH(1,($A20=$AE$8:$AE$160)*($F$6=$AD$8:$AD$160),0),$B$3)","v":"Tim Miller"},{"$f":"INDEX($AA$8:$AE$160,MATCH(1,($A20=$AE$8:$AE$160)*($F$6=$AD$8:$AD$160),0),$C$3)","v":"00:34:11"},{"$f":"INDEX($AA$8:$AE$160,MATCH(1,($A20=$AE$8:$AE$160)*($F$6=$AD$8:$AD$160),0),$D$3)","v":"HHH"},null,{"$f":"INDEX($AA$8:$AE$160,MATCH(1,($A20=$AE$8:$AE$160)*($J$6=$AD$8:$AD$160),0),$B$3)","v":"Bob Hughes"},{"$f":"INDEX($AA$8:$AE$160,MATCH(1,($A20=$AE$8:$AE$160)*($J$6=$AD$8:$AD$160),0),$C$3)","v":"00:46:45"},{"$f":"INDEX($AA$8:$AE$160,MATCH(1,($A20=$AE$8:$AE$160)*($J$6=$AD$8:$AD$160),0),$D$3)","v":"Lewes"},13,{"$f":"INDEX($AA$8:$AE$160,MATCH(1,($A20=$AE$8:$AE$160)*($N$6=$AD$8:$AD$160),0),$B$3)","v":"Olivia Treharne"},{"$f":"INDEX($AA$8:$AE$160,MATCH(1,($A20=$AE$8:$AE$160)*($N$6=$AD$8:$AD$160),0),$C$3)","v":"00:41:43"},{"$f":"INDEX($AA$8:$AE$160,MATCH(1,($A20=$AE$8:$AE$160)*($N$6=$AD$8:$AD$160),0),$D$3)","v":"HHH"},null,{"$f":"INDEX($AA$8:$AE$160,MATCH(1,($A20=$AE$8:$AE$160)*($R$6=$AD$8:$AD$160),0),$B$3)","v":"Fran Witt"},{"$f":"INDEX($AA$8:$AE$160,MATCH(1,($A20=$AE$8:$AE$160)*($R$6=$AD$8:$AD$160),0),$C$3)","v":"00:48:51"},{"$f":"INDEX($AA$8:$AE$160,MATCH(1,($A20=$AE$8:$AE$160)*($R$6=$AD$8:$AD$160),0),$D$3)","v":"Lewes"},{"$nulls":5},13,"PHX",{"$f":"Phoenix!D12","v":"Stuart Roberts "},{"$f":"Phoenix!E12","v":"00:32:21"},{"$f":"Phoenix!H12","v":"M V"},5]
[14,{"$f":"INDEX($AA$8:$AE$160,MATCH(1,($A21=$AE$8:$AE$160)*($B$6=$AD$8:$AD$160),0),$B$3)","v":"Philip Wallek"},{"$f":"INDEX($AA$8:$AE$160,MATCH(1,($A21=$AE$8:$AE$160)*($B$6=$AD$8:$AD$160),0),$C$3)","v":"00:33:24"},{"$f":"INDEX($AA$8:$AE$160,MATCH(1,($A21=$AE$8:$AE$160)*($B$6=$AD$8:$AD$160),0),$D$3)","v":"BHR"},null,{"$f":"INDEX($AA$8:$AE$160,MATCH(1,($A21=$AE$8:$AE$160)*($F$6=$AD$8:$AD$160),0),$B$3)","v":"Paul Lawrence "},{"$f":"INDEX($AA$8:$AE$160,MATCH(1,($A21=$AE$8:$AE$160)*($F$6=$AD$8:$AD$160),0),$C$3)","v":"00:34:30"},{"$f":"INDEX($AA$8:$AE$160,MATCH(1,($A21=$AE$8:$AE$160)*($F$6=$AD$8:$AD$160),0),$D$3)","v":"PHX"},null,{"$f":"INDEX($AA$8:$AE$160,MATCH(1,($A21=$AE$8:$AE$160)*($J$6=$AD$8:$AD$160),0),$B$3)","v":"Hugh St John"},{"$f":"INDEX($AA$8:$AE$160,MATCH(1,($A21=$AE$8:$AE$160)*($J$6=$AD$8:$AD$160),0),$C$3)","v":"00:47:16"},{"$f":"INDEX($AA$8:$AE$160,MATCH(1,($A21=$AE$8:$AE$160)*($J$6=$AD$8:$AD$160),0),$D$3)","v":"Lewes"},14,{"$f":"INDEX($AA$8:$AE$160,MATCH(1,($A21=$AE$8:$AE$160)*($N$6=$AD$8:$AD$160),0),$B$3)","v":"Liz Earley"},{"$f":"INDEX($AA$8:$AE$160,MATCH(1,($A21=$AE$8:$AE$160)*($N$6=$AD$8:$AD$160),0),$C$3)","v":"00:42:54"},{"$f":"INDEX($AA$8:$AE$160,MATCH(1,($A21=$AE$8:$AE$160)*($N$6=$AD$8:$AD$160),0),$D$3)","v":"HHH"},null,{"$f":"INDEX($AA$8:$AE$160,MATCH(1,($A21=$AE$8:$AE$160)*($R$6=$AD$8:$AD$160),0),$B$3)","v":"Sarah Russell "},{"$f":"INDEX($AA$8:$AE$160,MATCH(1,($A21=$AE$8:$AE$160)*($R$6=$AD$8:$AD$160),0),$C$3)","v":"00:48:54"},{"$f":"INDEX($AA$8:$AE$160,MATCH(1,($A21=$AE$8:$AE$160)*($R$6=$AD$8:$AD$160),0),$D$3)","v":"PHX"},{"$nulls":5},14,"HHH",{"$f":"HHH!D10","v":"Phil Payne"},{"$f":"HHH!E10","v":"00:32:24"},{"$f":"HHH!H10","v":"M S"},9]
[15,{"$f":"INDEX($AA$8:$AE$160,MATCH(1,($A22=$AE$8:$AE$160)*($B$6=$AD$8:$AD$160),0),$B$3)","v":"Matthew King"},{"$f":"INDEX($AA$8:$AE$160,MATCH(1,($A22=$AE$8:$AE$160)*($B$6=$AD$8:$AD$160),0),$C$3)","v":"00:33:39"},{"$f":"INDEX($AA$8:$AE$160,MATCH(1,($A22=$AE$8:$AE$160)*($B$6=$AD$8:$AD$160),0),$D$3)","v":"HHH"},null,{"$f":"INDEX($AA$8:$AE$160,MATCH(1,($A22=$AE$8:$AE$160)*($F$6=$AD$8:$AD$160),0),$B$3)","v":"Geoff Pike "},{"$f":"INDEX($AA$8:$AE$160,MATCH(1,($A22=$AE$8:$AE$160)*($F$6=$AD$8:$AD$160),0),$C$3)","v":"00:34:35"},{"$f":"INDEX($AA$8:$AE$160,MATCH(1,($A22=$AE$8:$AE$160)*($F$6=$AD$8:$AD$160),0),$D$3)","v":"PHX"},null,{"$f":"INDEX($AA$8:$AE$160,MATCH(1,($A22=$AE$8:$AE$160)*($J$6=$AD$8:$AD$160),0),$B$3)","v":"Andrew Chitty"},{"$f":"INDEX($AA$8:$AE$160,MATCH(1,($A22=$AE$8:$AE$160)*($J$6=$AD$8:$AD$160),0),$C$3)","v":"00:47:16.010"},{"$f":"INDEX($AA$8:$AE$160,MATCH(1,($A22=$AE$8:$AE$160)*($J$6=$AD$8:$AD$160),0),$D$3)","v":"Lewes"},15,{"$f":"INDEX($AA$8:$AE$160,MATCH(1,($A22=$AE$8:$AE$160)*($N$6=$AD$8:$AD$160),0),$B$3)","v":"Sarah King"},{"$f":"INDEX($AA$8:$AE$160,MATCH(1,($A22=$AE$8:$AE$160)*($N$6=$AD$8:$AD$160),0),$C$3)","v":"00:42:54.010"},{"$f":"INDEX($AA$8:$AE$160,MATCH(1,($A22=$AE$8:$AE$160)*($N$6=$AD$8:$AD$160),0),$D$3)","v":"HHH"},null,{"$f":"INDEX($AA$8:$AE$160,MATCH(1,($A22=$AE$8:$AE$160)*($R$6=$AD$8:$AD$160),0),$B$3)","v":"Linda Tullett"},{"$f":"INDEX($AA$8:$AE$160,MATCH(1,($A22=$AE$8:$AE$160)*($R$6=$AD$8:$AD$160),0),$C$3)","v":"00:50:41"},{"$f":"INDEX($AA$8:$AE$160,MATCH(1,($A22=$AE$8:$AE$160)*($R$6=$AD$8:$AD$160),0),$D$3)","v":"HHH"},{"$nulls":5},15,"HHH",{"$f":"HHH!D11","v":"Andy Hind"},{"$f":"HHH!E11","v":"00:32:26"},{"$f":"HHH!H11","v":"M V"},6]
[16,{"$f":"INDEX($AA$8:$AE$160,MATCH(1,($A23=$AE$8:$AE$160)*($B$6=$AD$8:$AD$160),0),$B$3)","v":"Michael Burke"},{"$f":"INDEX($AA$8:$AE$160,MATCH(1,($A23=$AE$8:$AE$160)*($B$6=$AD$8:$AD$160),0),$C$3)","v":"00:33:57"},{"$f":"INDEX($AA$8:$AE$160,MATCH(1,($A23=$AE$8:$AE$160)*($B$6=$AD$8:$AD$160),0),$D$3)","v":"HHH"},null,{"$f":"INDEX($AA$8:$AE$160,MATCH(1,($A23=$AE$8:$AE$160)*($F$6=$AD$8:$AD$160),0),$B$3)","v":"Donald Maclellan "},{"$f":"INDEX($AA$8:$AE$160,MATCH(1,($A23=$AE$8:$AE$160)*($F$6=$AD$8:$AD$160),0),$C$3)","v":"00:34:40"},{"$f":"INDEX($AA$8:$AE$160,MATCH(1,($A23=$AE$8:$AE$160)*($F$6=$AD$8:$AD$160),0),$D$3)","v":"PHX"},null,{"$f":"INDEX($AA$8:$AE$160,MATCH(1,($A23=$AE$8:$AE$160)*($J$6=$AD$8:$AD$160),0),$B$3)","v":"Colin Hartland"},{"$f":"INDEX($AA$8:$AE$160,MATCH(1,($A23=$AE$8:$AE$160)*($J$6=$AD$8:$AD$160),0),$C$3)","v":"00:47:43"},{"$f":"INDEX($AA$8:$AE$160,MATCH(1,($A23=$AE$8:$AE$160)*($J$6=$AD$8:$AD$160),0),$D$3)","v":"Lewes"},16,{"$f":"INDEX($AA$8:$AE$160,MATCH(1,($A23=$AE$8:$AE$160)*($N$6=$AD$8:$AD$160),0),$B$3)","v":"Flo Wolfe"},{"$f":"INDEX($AA$8:$AE$160,MATCH(1,($A23=$AE$8:$AE$160)*($N$6=$AD$8:$AD$160),0),$C$3)","v":"00:42:57"},{"$f":"INDEX($AA$8:$AE$160,MATCH(1,($A23=$AE$8:$AE$160)*($N$6=$AD$8:$AD$160),0),$D$3)","v":"BHR"},null,{"$f":"INDEX($AA$8:$AE$160,MATCH(1,($A23=$AE$8:$AE$160)*($R$6=$AD$8:$AD$160),0),$B$3)","v":"Emma Buckland"},{"$f":"INDEX($AA$8:$AE$160,MATCH(1,($A23=$AE$8:$AE$160)*($R$6=$AD$8:$AD$160),0),$C$3)","v":"00:51:00"},{"$f":"INDEX($AA$8:$AE$160,MATCH(1,($A23=$AE$8:$AE$160)*($R$6=$AD$8:$AD$160),0),$D$3)","v":"BHR"},{"$nulls":5},16,"HHH",{"$f":"HHH!D12","v":"James Moffat"},{"$f":"HHH!E12","v":"00:32:36"},{"$f":"HHH!H12","v":"M V"},7,"tied"]
[17,{"$f":"INDEX($AA$8:$AE$160,MATCH(1,($A24=$AE$8:$AE$160)*($B$6=$AD$8:$AD$160),0),$B$3)","v":"Peter Francis"},{"$f":"INDEX($AA$8:$AE$160,MATCH(1,($A24=$AE$8:$AE$160)*($B$6=$AD$8:$AD$160),0),$C$3)","v":"00:34:12"},{"$f":"INDEX($AA$8:$AE$160,MATCH(1,($A24=$AE$8:$AE$160)*($B$6=$AD$8:$AD$160),0),$D$3)","v":"HHH"},null,{"$f":"INDEX($AA$8:$AE$160,MATCH(1,($A24=$AE$8:$AE$160)*($F$6=$AD$8:$AD$160),0),$B$3)","v":"Barry Tullett"},{"$f":"INDEX($AA$8:$AE$160,MATCH(1,($A24=$AE$8:$AE$160)*($F$6=$AD$8:$AD$160),0),$C$3)","v":"00:34:53"},{"$f":"INDEX($AA$8:$AE$160,MATCH(1,($A24=$AE$8:$AE$160)*($F$6=$AD$8:$AD$160),0),$D$3)","v":"HHH"},null,{"$f":"INDEX($AA$8:$AE$160,MATCH(1,($A24=$AE$8:$AE$160)*($J$6=$AD$8:$AD$160),0),$B$3)","v":"Eogan McKenna "},{"$f":"INDEX($AA$8:$AE$160,MATCH(1,($A24=$AE$8:$AE$160)*($J$6=$AD$8:$AD$160),0),$C$3)","v":"00:49:56"},{"$f":"INDEX($AA$8:$AE$160,MATCH(1,($A24=$AE$8:$AE$160)*($J$6=$AD$8:$AD$160),0),$D$3)","v":"PHX"},17,{"$f":"INDEX($AA$8:$AE$160,MATCH(1,($A24=$AE$8:$AE$160)*($N$6=$AD$8:$AD$160),0),$B$3)","v":"Lydia Levy"},{"$f":"INDEX($AA$8:$AE$160,MATCH(1,($A24=$AE$8:$AE$160)*($N$6=$AD$8:$AD$160),0),$C$3)","v":"00:43:16"},{"$f":"INDEX($AA$8:$AE$160,MATCH(1,($A24=$AE$8:$AE$160)*($N$6=$AD$8:$AD$160),0),$D$3)","v":"HHH"},null,{"$f":"INDEX($AA$8:$AE$160,MATCH(1,($A24=$AE$8:$AE$160)*($R$6=$AD$8:$AD$160),0),$B$3)","v":"Emma Hodgson"},{"$f":"INDEX($AA$8:$AE$160,MATCH(1,($A24=$AE$8:$AE$160)*($R$6=$AD$8:$AD$160),0),$C$3)","v":"00:53:27"},{"$f":"INDEX($AA$8:$AE$160,MATCH(1,($A24=$AE$8:$AE$160)*($R$6=$AD$8:$AD$160),0),$D$3)","v":"Lewes"},{"$nulls":5},17,"PHX",{"$f":"Phoenix!D13","v":"Paul Weir "},{"$f":"Phoenix!E13","v":"00:32:36"},{"$f":"Phoenix!H13","v":"M S"},10,"tied"]
[18,{"$f":"INDEX($AA$8:$AE$160,MATCH(1,($A25=$AE$8:$AE$160)*($B$6=$AD$8:$AD$160),0),$B$3)","v":"Dermot Cameron "},{"$f":"INDEX($AA$8:$AE$160,MATCH(1,($A25=$AE$8:$AE$160)*($B$6=$AD$8:$AD$160),0),$C$3)","v":"00:34:19"},{"$f":"INDEX($AA$8:$AE$160,MATCH(1,($A25=$AE$8:$AE$160)*($B$6=$AD$8:$AD$160),0),$D$3)","v":"PHX"},null,{"$f":"INDEX($AA$8:$AE$160,MATCH(1,($A25=$AE$8:$AE$160)*($F$6=$AD$8:$AD$160),0),$B$3)","v":"Jim Whitelegg "},{"$f":"INDEX($AA$8:$AE$160,MATCH(1,($A25=$AE$8:$AE$160)*($F$6=$AD$8:$AD$160),0),$C$3)","v":"00:34:59"},{"$f":"INDEX($AA$8:$AE$160,MATCH(1,($A25=$AE$8:$AE$160)*($F$6=$AD$8:$AD$160),0),$D$3)","v":"PHX"},null,{"$f":"INDEX($AA$8:$AE$160,MATCH(1,($A25=$AE$8:$AE$160)*($J$6=$AD$8:$AD$160),0),$B$3)","v":"Rik Taub "},{"$f":"INDEX($AA$8:$AE$160,MATCH(1,($A25=$AE$8:$AE$160)*($J$6=$AD$8:$AD$160),0),$C$3)","v":"00:51:06"},{"$f":"INDEX($AA$8:$AE$160,MATCH(1,($A25=$AE$8:$AE$160)*($J$6=$AD$8:$AD$160),0),$D$3)","v":"PHX"},18,{"$f":"INDEX($AA$8:$AE$160,MATCH(1,($A25=$AE$8:$AE$160)*($N$6=$AD$8:$AD$160),0),$B$3)","v":"Gemma Morgan"},{"$f":"INDEX($AA$8:$AE$160,MATCH(1,($A25=$AE$8:$AE$160)*($N$6=$AD$8:$AD$160),0),$C$3)","v":"00:43:17"},{"$f":"INDEX($AA$8:$AE$160,MATCH(1,($A25=$AE$8:$AE$160)*($N$6=$AD$8:$AD$160),0),$D$3)","v":"HHH"},null,{"$f":"INDEX($AA$8:$AE$160,MATCH(1,($A25=$AE$8:$AE$160)*($R$6=$AD$8:$AD$160),0),$B$3)","v":"Emma Gardner"},{"$f":"INDEX($AA$8:$AE$160,MATCH(1,($A25=$AE$8:$AE$160)*($R$6=$AD$8:$AD$160),0),$C$3)","v":"00:54:04"},{"$f":"INDEX($AA$8:$AE$160,MATCH(1,($A25=$AE$8:$AE$160)*($R$6=$AD$8:$AD$160),0),$D$3)","v":"Lewes"},{"$nulls":5},18,"Lewes",{"$f":"LewesAC!D10","v":"Mike Green "},{"$f":"LewesAC!E10","v":"00:32:38"},{"$f":"LewesAC!H10","v":"M V"},8]
[19,{"$f":"INDEX($AA$8:$AE$160,MATCH(1,($A26=$AE$8:$AE$160)*($B$6=$AD$8:$AD$160),0),$B$3)","v":"Sébastien Béhuret "},{"$f":"INDEX($AA$8:$AE$160,MATCH(1,($A26=$AE$8:$AE$160)*($B$6=$AD$8:$AD$160),0),$C$3)","v":"00:34:22"},{"$f":"INDEX($AA$8:$AE$160,MATCH(1,($A26=$AE$8:$AE$160)*($B$6=$AD$8:$AD$160),0),$D$3)","v":"PHX"},null,{"$f":"INDEX($AA$8:$AE$160,MATCH(1,($A26=$AE$8:$AE$160)*($F$6=$AD$8:$AD$160),0),$B$3)","v":"Oliver Day"},{"$f":"INDEX($AA$8:$AE$160,MATCH(1,($A26=$AE$8:$AE$160)*($F$6=$AD$8:$AD$160),0),$C$3)","v":"00:35:07"},{"$f":"INDEX($AA$8:$AE$160,MATCH(1,($A26=$AE$8:$AE$160)*($F$6=$AD$8:$AD$160),0),$D$3)","v":"BHR"},null,{"$f":"INDEX($AA$8:$AE$160,MATCH(1,($A26=$AE$8:$AE$160)*($J$6=$AD$8:$AD$160),0),$B$3)","v":"Malcolm Kemp "},{"$f":"INDEX($AA$8:$AE$160,MATCH(1,($A26=$AE$8:$AE$160)*($J$6=$AD$8:$AD$160),0),$C$3)","v":"00:51:06"},{"$f":"INDEX($AA$8:$AE$160,MATCH(1,($A26=$AE$8:$AE$160)*($J$6=$AD$8:$AD$160),0),$D$3)","v":"PHX"},19,{"$f":"INDEX($AA$8:$AE$160,MATCH(1,($A26=$AE$8:$AE$160)*($N$6=$AD$8:$AD$160),0),$B$3)","v":"Beth Hancock"},{"$f":"INDEX($AA$8:$AE$160,MATCH(1,($A26=$AE$8:$AE$160)*($N$6=$AD$8:$AD$160),0),$C$3)","v":"00:43:48"},{"$f":"INDEX($AA$8:$AE$160,MATCH(1,($A26=$AE$8:$AE$160)*($N$6=$AD$8:$AD$160),0),$D$3)","v":"Lewes"},null,{"$f":"INDEX($AA$8:$AE$160,MATCH(1,($A26=$AE$8:$AE$160)*($R$6=$AD$8:$AD$160),0),$B$3)","v":"Julie Deakin "},{"$f":"INDEX($AA$8:$AE$160,MATCH(1,($A26=$AE$8:$AE$160)*($R$6=$AD$8:$AD$160),0),$C$3)","v":"00:54:12"},{"$f":"INDEX($AA$8:$AE$160,MATCH(1,($A26=$AE$8:$AE$160)*($R$6=$AD$8:$AD$160),0),$D$3)","v":"Lewes"},{"$nulls":5},19,"HHH",{"$f":"HHH!D13","v":"Matt Cook"},{"$f":"HHH!E13","v":"00:32:45"},{"$f":"HHH!H13","v":"M S"},11]
[20,{"$f":"INDEX($AA$8:$AE$160,MATCH(1,($A27=$AE$8:$AE$160)*($B$6=$AD$8:$AD$160),0),$B$3)","v":"Mark Nichol 1"},{"$f":"INDEX($AA$8:$AE$160,MATCH(1,($A27=$AE$8:$AE$160)*($B$6=$AD$8:$AD$160),0),$C$3)","v":"00:34:34"},{"$f":"INDEX($AA$8:$AE$160,MATCH(1,($A27=$AE$8:$AE$160)*($B$6=$AD$8:$AD$160),0),$D$3)","v":"BHR"},null,{"$f":"INDEX($AA$8:$AE$160,MATCH(1,($A27=$AE$8:$AE$160)*($F$6=$AD$8:$AD$160),0),$B$3)","v":"Simon Robinson"},{"$f":"INDEX($AA$8:$AE$160,MATCH(1,($A27=$AE$8:$AE$160)*($F$6=$AD$8:$AD$160),0),$C$3)","v":"00:35:32"},{"$f":"INDEX($AA$8:$AE$160,MATCH(1,($A27=$AE$8:$AE$160)*($F$6=$AD$8:$AD$160),0),$D$3)","v":"HHH"},null,{"$f":"INDEX($AA$8:$AE$160,MATCH(1,($A27=$AE$8:$AE$160)*($J$6=$AD$8:$AD$160),0),$B$3)","v":"Pete Brownlie"},{"$f":"INDEX($AA$8:$AE$160,MATCH(1,($A27=$AE$8:$AE$160)*($J$6=$AD$8:$AD$160),0),$C$3)","v":"00:51:40"},{"$f":"INDEX($AA$8:$AE$160,MATCH(1,($A27=$AE$8:$AE$160)*($J$6=$AD$8:$AD$160),0),$D$3)","v":"BHR"},20,{"$f":"INDEX($AA$8:$AE$160,MATCH(1,($A27=$AE$8:$AE$160)*($N$6=$AD$8:$AD$160),0),$B$3)","v":"Val Avella "},{"$f":"INDEX($AA$8:$AE$160,MATCH(1,($A27=$AE$8:$AE$160)*($N$6=$AD$8:$AD$160),0),$C$3)","v":"00:44:08"},{"$f":"INDEX($AA$8:$AE$160,MATCH(1,($A27=$AE$8:$AE$160)*($N$6=$AD$8:$AD$160),0),$D$3)","v":"PHX"},null,{"$f":"INDEX($AA$8:$AE$160,MATCH(1,($A27=$AE$8:$AE$160)*($R$6=$AD$8:$AD$160),0),$B$3)","v":"Eileen Adlam"},{"$f":"INDEX($AA$8:$AE$160,MATCH(1,($A27=$AE$8:$AE$160)*($R$6=$AD$8:$AD$160),0),$C$3)","v":"01:18:08"},{"$f":"INDEX($AA$8:$AE$160,MATCH(1,($A27=$AE$8:$AE$160)*($R$6=$AD$8:$AD$160),0),$D$3)","v":"BHR"},{"$nulls":5},20,"Lewes",{"$f":"LewesAC!D11","v":"Ben Pepler"},{"$f":"LewesAC!E11","v":"00:32:49"},{"$f":"LewesAC!H11","v":"M S"},12]
[21,{"$f":"INDEX($AA$8:$AE$160,MATCH(1,($A28=$AE$8:$AE$160)*($B$6=$AD$8:$AD$160),0),$B$3)","v":"Gregory Hilton"},{"$f":"INDEX($AA$8:$AE$160,MATCH(1,($A28=$AE$8:$AE$160)*($B$6=$AD$8:$AD$160),0),$C$3)","v":"00:35:09"},{"$f":"INDEX($AA$8:$AE$160,MATCH(1,($A28=$AE$8:$AE$160)*($B$6=$AD$8:$AD$160),0),$D$3)","v":"HHH"},null,{"$f":"INDEX($AA$8:$AE$160,MATCH(1,($A28=$AE$8:$AE$160)*($F$6=$AD$8:$AD$160),0),$B$3)","v":"Robert Cooper"},{"$f":"INDEX($AA$8:$AE$160,MATCH(1,($A28=$AE$8:$AE$160)*($F$6=$AD$8:$AD$160),0),$C$3)","v":"00:35:41"},{"$f":"INDEX($AA$8:$AE$160,MATCH(1,($A28=$AE$8:$AE$160)*($F$6=$AD$8:$AD$160),0),$D$3)","v":"Lewes"},null,{"$f":"INDEX($AA$8:$AE$160,MATCH(1,($A28=$AE$8:$AE$160)*($J$6=$AD$8:$AD$160),0),$B$3)","v":"David Clark"},{"$f":"INDEX($AA$8:$AE$160,MATCH(1,($A28=$AE$8:$AE$160)*($J$6=$AD$8:$AD$160),0),$C$3)","v":"01:01:54"},{"$f":"INDEX($AA$8:$AE$160,MATCH(1,($A28=$AE$8:$AE$160)*($J$6=$AD$8:$AD$160),0),$D$3)","v":"BHR"},21,{"$f":"INDEX($AA$8:$AE$160,MATCH(1,($A28=$AE$8:$AE$160)*($N$6=$AD$8:$AD$160),0),$B$3)","v":"Amy Lovejoy"},{"$f":"INDEX($AA$8:$AE$160,MATCH(1,($A28=$AE$8:$AE$160)*($N$6=$AD$8:$AD$160),0),$C$3)","v":"00:45:41"},{"$f":"INDEX($AA$8:$AE$160,MATCH(1,($A28=$AE$8:$AE$160)*($N$6=$AD$8:$AD$160),0),$D$3)","v":"HHH"},null,{"$f":"INDEX($AA$8:$AE$160,MATCH(1,($A28=$AE$8:$AE$160)*($R$6=$AD$8:$AD$160),0),$B$3)","v":{"$error":"#N/A"}},{"$f":"INDEX($AA$8:$AE$160,MATCH(1,($A28=$AE$8:$AE$160)*($R$6=$AD$8:$AD$160),0),$C$3)","v":{"$error":"#N/A"}},{"$f":"INDEX($AA$8:$AE$160,MATCH(1,($A28=$AE$8:$AE$160)*($R$6=$AD$8:$AD$160),0),$D$3)","v":{"$error":"#N/A"}},{"$nulls":5},21,"PHX",{"$f":"Phoenix!D14","v":"Tom Clewley "},{"$f":"Phoenix!E14","v":"00:33:00"},{"$f":"Phoenix!H14","v":"M S"},13]
[22,{"$f":"INDEX($AA$8:$AE$160,MATCH(1,($A29=$AE$8:$AE$160)*($B$6=$AD$8:$AD$160),0),$B$3)","v":"Simeon Wishlade"},{"$f":"INDEX($AA$8:$AE$160,MATCH(1,($A29=$AE$8:$AE$160)*($B$6=$AD$8:$AD$160),0),$C$3)","v":"00:35:31"},{"$f":"INDEX($AA$8:$AE$160,MATCH(1,($A29=$AE$8:$AE$160)*($B$6=$AD$8:$AD$160),0),$D$3)","v":"HHH"},null,{"$f":"INDEX($AA$8:$AE$160,MATCH(1,($A29=$AE$8:$AE$160)*($F$6=$AD$8:$AD$160),0),$B$3)","v":"Tom Sanderson "},{"$f":"INDEX($AA$8:$AE$160,MATCH(1,($A29=$AE$8:$AE$160)*($F$6=$AD$8:$AD$160),0),$C$3)","v":"00:35:47"},{"$f":"INDEX($AA$8:$AE$160,MATCH(1,($A29=$AE$8:$AE$160)*($F$6=$AD$8:$AD$160),0),$D$3)","v":"PHX"},null,{"$f":"INDEX($AA$8:$AE$160,MATCH(1,($A29=$AE$8:$AE$160)*($J$6=$AD$8:$AD$160),0),$B$3)","v":{"$error":"#N/A"}},{"$f":"INDEX($AA$8:$AE$160,MATCH(1,($A29=$AE$8:$AE$160)*($J$6=$AD$8:$AD$160),0),$C$3)","v":{"$error":"#N/A"}},{"$f":"INDEX($AA$8:$AE$160,MATCH(1,($A29=$AE$8:$AE$160)*($J$6=$AD$8:$AD$160),0),$D$3)","v":{"$error":"#N/A"}},22,{"$f":"INDEX($AA$8:$AE$160,MATCH(1,($A29=$AE$8:$AE$160)*($N$6=$AD$8:$AD$160),0),$B$3)","v":"Mercy Dennis-Smith"},{"$f":"INDEX($AA$8:$AE$160,MATCH(1,($A29=$AE$8:$AE$160)*($N$6=$AD$8:$AD$160),0),$C$3)","v":"00:46:50"},{"$f":"INDEX($AA$8:$AE$160,MATCH(1,($A29=$AE$8:$AE$160)*($N$6=$AD$8:$AD$160),0),$D$3)","v":"BHR"},{"$nulls":9},22,"BHR",{"$f":"BHR!D8","v":"Philip Wallek"},{"$f":"BHR!E8","v":"00:33:24"},{"$f":"BHR!H8","v":"M S"},14]
[23,{"$f":"INDEX($AA$8:$AE$160,MATCH(1,($A30=$AE$8:$AE$160)*($B$6=$AD$8:$AD$160),0),$B$3)","v":"Kai Robinson"},{"$f":"INDEX($AA$8:$AE$160,MATCH(1,($A30=$AE$8:$AE$160)*($B$6=$AD$8:$AD$160),0),$C$3)","v":"00:36:32"},{"$f":"INDEX($AA$8:$AE$160,MATCH(1,($A30=$AE$8:$AE$160)*($B$6=$AD$8:$AD$160),0),$D$3)","v":"HHH"},null,{"$f":"INDEX($AA$8:$AE$160,MATCH(1,($A30=$AE$8:$AE$160)*($F$6=$AD$8:$AD$160),0),$B$3)","v":"Paul Cousins"},{"$f":"INDEX($AA$8:$AE$160,MATCH(1,($A30=$AE$8:$AE$160)*($F$6=$AD$8:$AD$160),0),$C$3)","v":"00:35:57"},{"$f":"INDEX($AA$8:$AE$160,MATCH(1,($A30=$AE$8:$AE$160)*($F$6=$AD$8:$AD$160),0),$D$3)","v":"HHH"},null,{"$f":"INDEX($AA$8:$AE$160,MATCH(1,($A30=$AE$8:$AE$160)*($J$6=$AD$8:$AD$160),0),$B$3)","v":{"$error":"#N/A"}},{"$f":"INDEX($AA$8:$AE$160,MATCH(1,($A30=$AE$8:$AE$160)*($J$6=$AD$8:$AD$160),0),$C$3)","v":{"$error":"#N/A"}},{"$f":"INDEX($AA$8:$AE$160,MATCH(1,($A30=$AE$8:$AE$160)*($J$6=$AD$8:$AD$160),0),$D$3)","v":{"$error":"#N/A"}},23,{"$f":"INDEX($AA$8:$AE$160,MATCH(1,($A30=$AE$8:$AE$160)*($N$6=$AD$8:$AD$160),0),$B$3)","v":"Carys Hind"},{"$f":"INDEX($AA$8:$AE$160,MATCH(1,($A30=$AE$8:$AE$160)*($N$6=$AD$8:$AD$160),0),$C$3)","v":"00:50:55"},{"$f":"INDEX($AA$8:$AE$160,MATCH(1,($A30=$AE$8:$AE$160)*($N$6=$AD$8:$AD$160),0),$D$3)","v":"HHH"},{"$nulls":9},23,"HHH",{"$f":"HHH!D14","v":"Matthew King"},{"$f":"HHH!E14","v":"00:33:39"},{"$f":"HHH!H14","v":"M S"},15]
[24,{"$f":"INDEX($AA$8:$AE$160,MATCH(1,($A31=$AE$8:$AE$160)*($B$6=$AD$8:$AD$160),0),$B$3)","v":"Russell Mullen"},{"$f":"INDEX($AA$8:$AE$160,MATCH(1,($A31=$AE$8:$AE$160)*($B$6=$AD$8:$AD$160),0),$C$3)","v":"00:36:52"},{"$f":"INDEX($AA$8:$AE$160,MATCH(1,($A31=$AE$8:$AE$160)*($B$6=$AD$8:$AD$160),0),$D$3)","v":"HHH"},null,{"$f":"INDEX($AA$8:$AE$160,MATCH(1,($A31=$AE$8:$AE$160)*($F$6=$AD$8:$AD$160),0),$B$3)","v":"Julian Boyer"},{"$f":"INDEX($AA$8:$AE$160,MATCH(1,($A31=$AE$8:$AE$160)*($F$6=$AD$8:$AD$160),0),$C$3)","v":"00:36:14"},{"$f":"INDEX($AA$8:$AE$160,MATCH(1,($A31=$AE$8:$AE$160)*($F$6=$AD$8:$AD$160),0),$D$3)","v":"HHH"},null,{"$f":"INDEX($AA$8:$AE$160,MATCH(1,($A31=$AE$8:$AE$160)*($J$6=$AD$8:$AD$160),0),$B$3)","v":{"$error":"#N/A"}},{"$f":"INDEX($AA$8:$AE$160,MATCH(1,($A31=$AE$8:$AE$160)*($J$6=$AD$8:$AD$160),0),$C$3)","v":{"$error":"#N/A"}},{"$f":"INDEX($AA$8:$AE$160,MATCH(1,($A31=$AE$8:$AE$160)*($J$6=$AD$8:$AD$160),0),$D$3)","v":{"$error":"#N/A"}},24,{"$f":"INDEX($AA$8:$AE$160,MATCH(1,($A31=$AE$8:$AE$160)*($N$6=$AD$8:$AD$160),0),$B$3)","v":"Christelle Maugiron"},{"$f":"INDEX($AA$8:$AE$160,MATCH(1,($A31=$AE$8:$AE$160)*($N$6=$AD$8:$AD$160),0),$C$3)","v":"00:51:47"},{"$f":"INDEX($AA$8:$AE$160,MATCH(1,($A31=$AE$8:$AE$160)*($N$6=$AD$8:$AD$160),0),$D$3)","v":"BHR"},{"$nulls":9},24,"PHX",{"$f":"Phoenix!D15","v":"Matt Greenall "},{"$f":"Phoenix!E15","v":"00:33:47"},{"$f":"Phoenix!H15","v":"M V"},9]
[25,{"$f":"INDEX($AA$8:$AE$160,MATCH(1,($A32=$AE$8:$AE$160)*($B$6=$AD$8:$AD$160),0),$B$3)","v":"Andrew Haslam "},{"$f":"INDEX($AA$8:$AE$160,MATCH(1,($A32=$AE$8:$AE$160)*($B$6=$AD$8:$AD$160),0),$C$3)","v":"00:37:50"},{"$f":"INDEX($AA$8:$AE$160,MATCH(1,($A32=$AE$8:$AE$160)*($B$6=$AD$8:$AD$160),0),$D$3)","v":"PHX"},null,{"$f":"INDEX($AA$8:$AE$160,MATCH(1,($A32=$AE$8:$AE$160)*($F$6=$AD$8:$AD$160),0),$B$3)","v":"Dave Warren"},{"$f":"INDEX($AA$8:$AE$160,MATCH(1,($A32=$AE$8:$AE$160)*($F$6=$AD$8:$AD$160),0),$C$3)","v":"00:36:34"},{"$f":"INDEX($AA$8:$AE$160,MATCH(1,($A32=$AE$8:$AE$160)*($F$6=$AD$8:$AD$160),0),$D$3)","v":"HHH"},{"$nulls":4},25,{"$f":"INDEX($AA$8:$AE$160,MATCH(1,($A32=$AE$8:$AE$160)*($N$6=$AD$8:$AD$160),0),$B$3)","v":"Naomi Ross"},{"$f":"INDEX($AA$8:$AE$160,MATCH(1,($A32=$AE$8:$AE$160)*($N$6=$AD$8:$AD$160),0),$C$3)","v":"00:54:10"},{"$f":"INDEX($AA$8:$AE$160,MATCH(1,($A32=$AE$8:$AE$160)*($N$6=$AD$8:$AD$160),0),$D$3)","v":"Lewes"},{"$nulls":9},25,"PHX",{"$f":"Phoenix!D16","v":"Tony Rickwood "},{"$f":"Phoenix!E16","v":"00:33:55"},{"$f":"Phoenix!H16","v":"M V"},10]
[26,{"$f":"INDEX($AA$8:$AE$160,MATCH(1,($A33=$AE$8:$AE$160)*($B$6=$AD$8:$AD$160),0),$B$3)","v":"Matt Howells"},{"$f":"INDEX($AA$8:$AE$160,MATCH(1,($A33=$AE$8:$AE$160)*($B$6=$AD$8:$AD$160),0),$C$3)","v":"00:39:39"},{"$f":"INDEX($AA$8:$AE$160,MATCH(1,($A33=$AE$8:$AE$160)*($B$6=$AD$8:$AD$160),0),$D$3)","v":"HHH"},null,{"$f":"INDEX($AA$8:$AE$160,MATCH(1,($A33=$AE$8:$AE$160)*($F$6=$AD$8:$AD$160),0),$B$3)","v":"Barry Blackwell "},{"$f":"INDEX($AA$8:$AE$160,MATCH(1,($A33=$AE$8:$AE$160)*($F$6=$AD$8:$AD$160),0),$C$3)","v":"00:36:40"},{"$f":"INDEX($AA$8:$AE$160,MATCH(1,($A33=$AE$8:$AE$160)*($F$6=$AD$8:$AD$160),0),$D$3)","v":"PHX"},{"$nulls":4},26,{"$f":"INDEX($AA$8:$AE$160,MATCH(1,($A33=$AE$8:$AE$160)*($N$6=$AD$8:$AD$160),0),$B$3)","v":"Ella Grabsky "},{"$f":"INDEX($AA$8:$AE$160,MATCH(1,($A33=$AE$8:$AE$160)*($N$6=$AD$8:$AD$160),0),$C$3)","v":"01:00:42"},{"$f":"INDEX($AA$8:$AE$160,MATCH(1,($A33=$AE$8:$AE$160)*($N$6=$AD$8:$AD$160),0),$D$3)","v":"PHX"},{"$nulls":9},26,"Lewes",{"$f":"LewesAC!D12","v":"Ben Hodgson"},{"$f":"LewesAC!E12","v":"00:33:57"},{"$f":"LewesAC!H12","v":"M V"},11,"tied"]
[27,{"$f":"INDEX($AA$8:$AE$160,MATCH(1,($A34=$AE$8:$AE$160)*($B$6=$AD$8:$AD$160),0),$B$3)","v":"Josh Franks"},{"$f":"INDEX($AA$8:$AE$160,MATCH(1,($A34=$AE$8:$AE$160)*($B$6=$AD$8:$AD$160),0),$C$3)","v":"00:43:10"},{"$f":"INDEX($AA$8:$AE$160,MATCH(1,($A34=$AE$8:$AE$160)*($B$6=$AD$8:$AD$160),0),$D$3)","v":"HHH"},null,{"$f":"INDEX($AA$8:$AE$160,MATCH(1,($A34=$AE$8:$AE$160)*($F$6=$AD$8:$AD$160),0),$B$3)","v":"Andy Bone "},{"$f":"INDEX($AA$8:$AE$160,MATCH(1,($A34=$AE$8:$AE$160)*($F$6=$AD$8:$AD$160),0),$C$3)","v":"00:37:12"},{"$f":"INDEX($AA$8:$AE$160,MATCH(1,($A34=$AE$8:$AE$160)*($F$6=$AD$8:$AD$160),0),$D$3)","v":"PHX"},{"$nulls":4},27,{"$f":"INDEX($AA$8:$AE$160,MATCH(1,($A34=$AE$8:$AE$160)*($N$6=$AD$8:$AD$160),0),$B$3)","v":"Isabelle Adlam"},{"$f":"INDEX($AA$8:$AE$160,MATCH(1,($A34=$AE$8:$AE$160)*($N$6=$AD$8:$AD$160),0),$C$3)","v":"01:15:00"},{"$f":"INDEX($AA$8:$AE$160,MATCH(1,($A34=$AE$8:$AE$160)*($N$6=$AD$8:$AD$160),0),$D$3)","v":"BHR"},{"$nulls":9},27,"HHH",{"$f":"HHH!D15","v":"Michael Burke"},{"$f":"HHH!E15","v":"00:33:57"},{"$f":"HHH!H15","v":"M S"},16,"tied"]
[28,{"$f":"INDEX($AA$8:$AE$160,MATCH(1,($A35=$AE$8:$AE$160)*($B$6=$AD$8:$AD$160),0),$B$3)","v":"Steve Barrett"},{"$f":"INDEX($AA$8:$AE$160,MATCH(1,($A35=$AE$8:$AE$160)*($B$6=$AD$8:$AD$160),0),$C$3)","v":"00:44:52"},{"$f":"INDEX($AA$8:$AE$160,MATCH(1,($A35=$AE$8:$AE$160)*($B$6=$AD$8:$AD$160),0),$D$3)","v":"BHR"},null,{"$f":"INDEX($AA$8:$AE$160,MATCH(1,($A35=$AE$8:$AE$160)*($F$6=$AD$8:$AD$160),0),$B$3)","v":"Michael Ussher"},{"$f":"INDEX($AA$8:$AE$160,MATCH(1,($A35=$AE$8:$AE$160)*($F$6=$AD$8:$AD$160),0),$C$3)","v":"00:37:39"},{"$f":"INDEX($AA$8:$AE$160,MATCH(1,($A35=$AE$8:$AE$160)*($F$6=$AD$8:$AD$160),0),$D$3)","v":"Lewes"},{"$nulls":5},{"$f":"INDEX($AA$8:$AE$160,MATCH(1,($A35=$AE$8:$AE$160)*($N$6=$AD$8:$AD$160),0),$B$3)","v":{"$error":"#N/A"}},{"$f":"INDEX($AA$8:$AE$160,MATCH(1,($A35=$AE$8:$AE$160)*($N$6=$AD$8:$AD$160),0),$C$3)","v":{"$error":"#N/A"}},{"$f":"INDEX($AA$8:$AE$160,MATCH(1,($A35=$AE$8:$AE$160)*($N$6=$AD$8:$AD$160),0),$D$3)","v":{"$error":"#N/A"}},{"$nulls":9},28,"Lewes",{"$f":"LewesAC!D13","v":"Rick Curtis"},{"$f":"LewesAC!E13","v":"00:34:00"},{"$f":"LewesAC!H13","v":"M V"},12]
[29,{"$f":"INDEX($AA$8:$AE$160,MATCH(1,($A36=$AE$8:$AE$160)*($B$6=$AD$8:$AD$160),0),$B$3)","v":"Cameron Cooper"},{"$f":"INDEX($AA$8:$AE$160,MATCH(1,($A36=$AE$8:$AE$160)*($B$6=$AD$8:$AD$160),0),$C$3)","v":"00:47:57"},{"$f":"INDEX($AA$8:$AE$160,MATCH(1,($A36=$AE$8:$AE$160)*($B$6=$AD$8:$AD$160),0),$D$3)","v":"BHR"},null,{"$f":"INDEX($AA$8:$AE$160,MATCH(1,($A36=$AE$8:$AE$160)*($F$6=$AD$8:$AD$160),0),$B$3)","v":"Ian Jones "},{"$f":"INDEX($AA$8:$AE$160,MATCH(1,($A36=$AE$8:$AE$160)*($F$6=$AD$8:$AD$160),0),$C$3)","v":"00:37:54"},{"$f":"INDEX($AA$8:$AE$160,MATCH(1,($A36=$AE$8:$AE$160)*($F$6=$AD$8:$AD$160),0),$D$3)","v":"BHR"},{"$nulls":5},{"$f":"INDEX($AA$8:$AE$160,MATCH(1,($A36=$AE$8:$AE$160)*($N$6=$AD$8:$AD$160),0),$B$3)","v":{"$error":"#N/A"}},{"$f":"INDEX($AA$8:$AE$160,MATCH(1,($A36=$AE$8:$AE$160)*($N$6=$AD$8:$AD$160),0),$C$3)","v":{"$error":"#N/A"}},{"$f":"INDEX($AA$8:$AE$160,MATCH(1,($A36=$AE$8:$AE$160)*($N$6=$AD$8:$AD$160),0),$D$3)","v":{"$error":"#N/A"}},{"$nulls":9},29,"HHH",{"$f":"HHH!D16","v":"Tim Miller"},{"$f":"HHH!E16","v":"00:34:11"},{"$f":"HHH!H16","v":"M V"},13]
[30,{"$f":"INDEX($AA$8:$AE$160,MATCH(1,($A37=$AE$8:$AE$160)*($B$6=$AD$8:$AD$160),0),$B$3)","v":"Chris Hine"},{"$f":"INDEX($AA$8:$AE$160,MATCH(1,($A37=$AE$8:$AE$160)*($B$6=$AD$8:$AD$160),0),$C$3)","v":"00:50:35"},{"$f":"INDEX($AA$8:$AE$160,MATCH(1,($A37=$AE$8:$AE$160)*($B$6=$AD$8:$AD$160),0),$D$3)","v":"BHR"},null,{"$f":"INDEX($AA$8:$AE$160,MATCH(1,($A37=$AE$8:$AE$160)*($F$6=$AD$8:$AD$160),0),$B$3)","v":"Andy Dray"},{"$f":"INDEX($AA$8:$AE$160,MATCH(1,($A37=$AE$8:$AE$160)*($F$6=$AD$8:$AD$160),0),$C$3)","v":"00:37:56"},{"$f":"INDEX($AA$8:$AE$160,MATCH(1,($A37=$AE$8:$AE$160)*($F$6=$AD$8:$AD$160),0),$D$3)","v":"HHH"},{"$nulls":17},30,"HHH",{"$f":"HHH!D17","v":"Peter Francis"},{"$f":"HHH!E17","v":"00:34:12"},{"$f":"HHH!H17","v":"M S"},17]
[31,{"$f":"INDEX($AA$8:$AE$160,MATCH(1,($A38=$AE$8:$AE$160)*($B$6=$AD$8:$AD$160),0),$B$3)","v":{"$error":"#N/A"}},{"$f":"INDEX($AA$8:$AE$160,MATCH(1,($A38=$AE$8:$AE$160)*($B$6=$AD$8:$AD$160),0),$C$3)","v":{"$error":"#N/A"}},{"$f":"INDEX($AA$8:$AE$160,MATCH(1,($A38=$AE$8:$AE$160)*($B$6=$AD$8:$AD$160),0),$D$3)","v":{"$error":"#N/A"}},null,{"$f":"INDEX($AA$8:$AE$160,MATCH(1,($A38=$AE$8:$AE$160)*($F$6=$AD$8:$AD$160),0),$B$3)","v":"Mauro Lazzati"},{"$f":"INDEX($AA$8:$AE$160,MATCH(1,($A38=$AE$8:$AE$160)*($F$6=$AD$8:$AD$160),0),$C$3)","v":"00:38:26"},{"$f":"INDEX($AA$8:$AE$160,MATCH(1,($A38=$AE$8:$AE$160)*($F$6=$AD$8:$AD$160),0),$D$3)","v":"Lewes"},{"$nulls":17},31,"PHX",{"$f":"Phoenix!D17","v":"Dermot Cameron "},{"$f":"Phoenix!E17","v":"00:34:19"},{"$f":"Phoenix!H17","v":"M S"},18]
[32,{"$f":"INDEX($AA$8:$AE$160,MATCH(1,($A39=$AE$8:$AE$160)*($B$6=$AD$8:$AD$160),0),$B$3)","v":{"$error":"#N/A"}},{"$f":"INDEX($AA$8:$AE$160,MATCH(1,($A39=$AE$8:$AE$160)*($B$6=$AD$8:$AD$160),0),$C$3)","v":{"$error":"#N/A"}},{"$f":"INDEX($AA$8:$AE$160,MATCH(1,($A39=$AE$8:$AE$160)*($B$6=$AD$8:$AD$160),0),$D$3)","v":{"$error":"#N/A"}},null,{"$f":"INDEX($AA$8:$AE$160,MATCH(1,($A39=$AE$8:$AE$160)*($F$6=$AD$8:$AD$160),0),$B$3)","v":"Andy Pumphrey "},{"$f":"INDEX($AA$8:$AE$160,MATCH(1,($A39=$AE$8:$AE$160)*($F$6=$AD$8:$AD$160),0),$C$3)","v":"00:38:28"},{"$f":"INDEX($AA$8:$AE$160,MATCH(1,($A39=$AE$8:$AE$160)*($F$6=$AD$8:$AD$160),0),$D$3)","v":"PHX"},{"$nulls":17},32,"PHX",{"$f":"Phoenix!D18","v":"Sébastien Béhuret "},{"$f":"Phoenix!E18","v":"00:34:22"},{"$f":"Phoenix!H18","v":"M S"},19]
[33,{"$f":"INDEX($AA$8:$AE$160,MATCH(1,($A40=$AE$8:$AE$160)*($B$6=$AD$8:$AD$160),0),$B$3)","v":{"$error":"#N/A"}},{"$f":"INDEX($AA$8:$AE$160,MATCH(1,($A40=$AE$8:$AE$160)*($B$6=$AD$8:$AD$160),0),$C$3)","v":{"$error":"#N/A"}},{"$f":"INDEX($AA$8:$AE$160,MATCH(1,($A40=$AE$8:$AE$160)*($B$6=$AD$8:$AD$160),0),$D$3)","v":{"$error":"#N/A"}},null,{"$f":"INDEX($AA$8:$AE$160,MATCH(1,($A40=$AE$8:$AE$160)*($F$6=$AD$8:$AD$160),0),$B$3)","v":"Chris Faulkner"},{"$f":"INDEX($AA$8:$AE$160,MATCH(1,($A40=$AE$8:$AE$160)*($F$6=$AD$8:$AD$160),0),$C$3)","v":"00:38:32"},{"$f":"INDEX($AA$8:$AE$160,MATCH(1,($A40=$AE$8:$AE$160)*($F$6=$AD$8:$AD$160),0),$D$3)","v":"HHH"},{"$nulls":17},33,"PHX",{"$f":"Phoenix!D19","v":"Bobby Searle "},{"$f":"Phoenix!E19","v":"00:34:23"},{"$f":"Phoenix!H19","v":"F S"},{"$f":"COUNTIFS($AD$8:$AD$160,AD40,$AC$8:$AC$160,\"<\"&AC40)+1","v":1}]
[34,{"$nulls":4},{"$f":"INDEX($AA$8:$AE$160,MATCH(1,($A41=$AE$8:$AE$160)*($F$6=$AD$8:$AD$160),0),$B$3)","v":"Jamie Goodhead"},{"$f":"INDEX($AA$8:$AE$160,MATCH(1,($A41=$AE$8:$AE$160)*($F$6=$AD$8:$AD$160),0),$C$3)","v":"00:38:39"},{"$f":"INDEX($AA$8:$AE$160,MATCH(1,($A41=$AE$8:$AE$160)*($F$6=$AD$8:$AD$160),0),$D$3)","v":"BHR"},{"$nulls":17},34,"PHX",{"$f":"Phoenix!D20","v":"Paul Lawrence "},{"$f":"Phoenix!E20","v":"00:34:30"},{"$f":"Phoenix!H20","v":"M V"},14]
[35,{"$nulls":4},{"$f":"INDEX($AA$8:$AE$160,MATCH(1,($A42=$AE$8:$AE$160)*($F$6=$AD$8:$AD$160),0),$B$3)","v":"Ian Dumbrell"},{"$f":"INDEX($AA$8:$AE$160,MATCH(1,($A42=$AE$8:$AE$160)*($F$6=$AD$8:$AD$160),0),$C$3)","v":"00:38:39.010"},{"$f":"INDEX($AA$8:$AE$160,MATCH(1,($A42=$AE$8:$AE$160)*($F$6=$AD$8:$AD$160),0),$D$3)","v":"HHH"},{"$nulls":17},35,"BHR",{"$f":"BHR!D9","v":"Mark Nichol 1"},{"$f":"BHR!E9","v":"00:34:34"},{"$f":"BHR!H9","v":"M S"},20]
[36,{"$nulls":4},{"$f":"INDEX($AA$8:$AE$160,MATCH(1,($A43=$AE$8:$AE$160)*($F$6=$AD$8:$AD$160),0),$B$3)","v":"Jason Robinson"},{"$f":"INDEX($AA$8:$AE$160,MATCH(1,($A43=$AE$8:$AE$160)*($F$6=$AD$8:$AD$160),0),$C$3)","v":"00:38:48"},{"$f":"INDEX($AA$8:$AE$160,MATCH(1,($A43=$AE$8:$AE$160)*($F$6=$AD$8:$AD$160),0),$D$3)","v":"HHH"},{"$nulls":17},36,"PHX",{"$f":"Phoenix!D21","v":"Geoff Pike "},{"$f":"Phoenix!E21","v":"00:34:35"},{"$f":"Phoenix!H21","v":"M V"},15]
[37,{"$nulls":4},{"$f":"INDEX($AA$8:$AE$160,MATCH(1,($A44=$AE$8:$AE$160)*($F$6=$AD$8:$AD$160),0),$B$3)","v":"Rob Stanway"},{"$f":"INDEX($AA$8:$AE$160,MATCH(1,($A44=$AE$8:$AE$160)*($F$6=$AD$8:$AD$160),0),$C$3)","v":"00:39:01"},{"$f":"INDEX($AA$8:$AE$160,MATCH(1,($A44=$AE$8:$AE$160)*($F$6=$AD$8:$AD$160),0),$D$3)","v":"Lewes"},{"$nulls":17},37,"PHX",{"$f":"Phoenix!D22","v":"Donald Maclellan "},{"$f":"Phoenix!E22","v":"00:34:40"},{"$f":"Phoenix!H22","v":"M V"},16,"tied"]
[38,{"$nulls":4},{"$f":"INDEX($AA$8:$AE$160,MATCH(1,($A45=$AE$8:$AE$160)*($F$6=$AD$8:$AD$160),0),$B$3)","v":"Andrew Brooks "},{"$f":"INDEX($AA$8:$AE$160,MATCH(1,($A45=$AE$8:$AE$160)*($F$6=$AD$8:$AD$160),0),$C$3)","v":"00:39:09"},{"$f":"INDEX($AA$8:$AE$160,MATCH(1,($A45=$AE$8:$AE$160)*($F$6=$AD$8:$AD$160),0),$D$3)","v":"PHX"},{"$nulls":17},38,"PHX",{"$f":"Phoenix!D23","v":"Paul Whelpton "},{"$f":"Phoenix!E23","v":"00:34:40"},{"$f":"Phoenix!H23","v":"M SV"},1,"tied"]
[39,{"$nulls":4},{"$f":"INDEX($AA$8:$AE$160,MATCH(1,($A46=$AE$8:$AE$160)*($F$6=$AD$8:$AD$160),0),$B$3)","v":"Mat Homewood"},{"$f":"INDEX($AA$8:$AE$160,MATCH(1,($A46=$AE$8:$AE$160)*($F$6=$AD$8:$AD$160),0),$C$3)","v":"00:39:37"},{"$f":"INDEX($AA$8:$AE$160,MATCH(1,($A46=$AE$8:$AE$160)*($F$6=$AD$8:$AD$160),0),$D$3)","v":"Lewes"},{"$nulls":17},39,"HHH",{"$f":"HHH!D18","v":"Barry Tullett"},{"$f":"HHH!E18","v":"00:34:53"},{"$f":"HHH!H18","v":"M V"},17]
[40,{"$nulls":4},{"$f":"INDEX($AA$8:$AE$160,MATCH(1,($A47=$AE$8:$AE$160)*($F$6=$AD$8:$AD$160),0),$B$3)","v":"David Foster"},{"$f":"INDEX($AA$8:$AE$160,MATCH(1,($A47=$AE$8:$AE$160)*($F$6=$AD$8:$AD$160),0),$C$3)","v":"00:39:39"},{"$f":"INDEX($AA$8:$AE$160,MATCH(1,($A47=$AE$8:$AE$160)*($F$6=$AD$8:$AD$160),0),$D$3)","v":"Lewes"},{"$nulls":17},40,"PHX",{"$f":"Phoenix!D24","v":"Jim Whitelegg "},{"$f":"Phoenix!E24","v":"00:34:59"},{"$f":"Phoenix!H24","v":"M V"},18]
[41,{"$nulls":4},{"$f":"INDEX($AA$8:$AE$160,MATCH(1,($A48=$AE$8:$AE$160)*($F$6=$AD$8:$AD$160),0),$B$3)","v":"Mike Townley "},{"$f":"INDEX($AA$8:$AE$160,MATCH(1,($A48=$AE$8:$AE$160)*($F$6=$AD$8:$AD$160),0),$C$3)","v":"00:39:55"},{"$f":"INDEX($AA$8:$AE$160,MATCH(1,($A48=$AE$8:$AE$160)*($F$6=$AD$8:$AD$160),0),$D$3)","v":"PHX"},{"$nulls":17},41,"BHR",{"$f":"BHR!D10","v":"Oliver Day"},{"$f":"BHR!E10","v":"00:35:07"},{"$f":"BHR!H10","v":"M V"},19]
[42,{"$nulls":4},{"$f":"INDEX($AA$8:$AE$160,MATCH(1,($A49=$AE$8:$AE$160)*($F$6=$AD$8:$AD$160),0),$B$3)","v":"Geoff Manns "},{"$f":"INDEX($AA$8:$AE$160,MATCH(1,($A49=$AE$8:$AE$160)*($F$6=$AD$8:$AD$160),0),$C$3)","v":"00:39:58"},{"$f":"INDEX($AA$8:$AE$160,MATCH(1,($A49=$AE$8:$AE$160)*($F$6=$AD$8:$AD$160),0),$D$3)","v":"PHX"},{"$nulls":17},42,"HHH",{"$f":"HHH!D19","v":"Gregory Hilton"},{"$f":"HHH!E19","v":"00:35:09"},{"$f":"HHH!H19","v":"M S"},21]
[43,{"$nulls":4},{"$f":"INDEX($AA$8:$AE$160,MATCH(1,($A50=$AE$8:$AE$160)*($F$6=$AD$8:$AD$160),0),$B$3)","v":"Peter Harding"},{"$f":"INDEX($AA$8:$AE$160,MATCH(1,($A50=$AE$8:$AE$160)*($F$6=$AD$8:$AD$160),0),$C$3)","v":"00:42:05"},{"$f":"INDEX($AA$8:$AE$160,MATCH(1,($A50=$AE$8:$AE$160)*($F$6=$AD$8:$AD$160),0),$D$3)","v":"HHH"},{"$nulls":17},43,"HHH",{"$f":"HHH!D20","v":"Simeon Wishlade"},{"$f":"HHH!E20","v":"00:35:31"},{"$f":"HHH!H20","v":"M S"},22]
[44,{"$nulls":4},{"$f":"INDEX($AA$8:$AE$160,MATCH(1,($A51=$AE$8:$AE$160)*($F$6=$AD$8:$AD$160),0),$B$3)","v":"Andy Perris"},{"$f":"INDEX($AA$8:$AE$160,MATCH(1,($A51=$AE$8:$AE$160)*($F$6=$AD$8:$AD$160),0),$C$3)","v":"00:44:19"},{"$f":"INDEX($AA$8:$AE$160,MATCH(1,($A51=$AE$8:$AE$160)*($F$6=$AD$8:$AD$160),0),$D$3)","v":"Lewes"},{"$nulls":17},44,"HHH",{"$f":"HHH!D21","v":"Simon Robinson"},{"$f":"HHH!E21","v":"00:35:32"},{"$f":"HHH!H21","v":"M V"},20]
[45,{"$nulls":4},{"$f":"INDEX($AA$8:$AE$160,MATCH(1,($A52=$AE$8:$AE$160)*($F$6=$AD$8:$AD$160),0),$B$3)","v":"Carl Bicknell"},{"$f":"INDEX($AA$8:$AE$160,MATCH(1,($A52=$AE$8:$AE$160)*($F$6=$AD$8:$AD$160),0),$C$3)","v":"00:46:24"},{"$f":"INDEX($AA$8:$AE$160,MATCH(1,($A52=$AE$8:$AE$160)*($F$6=$AD$8:$AD$160),0),$D$3)","v":"HHH"},{"$nulls":17},45,"Lewes",{"$f":"LewesAC!D14","v":"Robert Cooper"},{"$f":"LewesAC!E14","v":"00:35:41"},{"$f":"LewesAC!H14","v":"M V"},21]
[46,{"$nulls":4},{"$f":"INDEX($AA$8:$AE$160,MATCH(1,($A53=$AE$8:$AE$160)*($F$6=$AD$8:$AD$160),0),$B$3)","v":"Thomas Peel-Yates"},{"$f":"INDEX($AA$8:$AE$160,MATCH(1,($A53=$AE$8:$AE$160)*($F$6=$AD$8:$AD$160),0),$C$3)","v":"00:46:43"},{"$f":"INDEX($AA$8:$AE$160,MATCH(1,($A53=$AE$8:$AE$160)*($F$6=$AD$8:$AD$160),0),$D$3)","v":"BHR"},{"$nulls":17},46,"PHX",{"$f":"Phoenix!D25","v":"Tom Sanderson "},{"$f":"Phoenix!E25","v":"00:35:47"},{"$f":"Phoenix!H25","v":"M V"},22]
[47,{"$nulls":4},{"$f":"INDEX($AA$8:$AE$160,MATCH(1,($A54=$AE$8:$AE$160)*($F$6=$AD$8:$AD$160),0),$B$3)","v":"Bill Whitehead"},{"$f":"INDEX($AA$8:$AE$160,MATCH(1,($A54=$AE$8:$AE$160)*($F$6=$AD$8:$AD$160),0),$C$3)","v":"00:48:24"},{"$f":"INDEX($AA$8:$AE$160,MATCH(1,($A54=$AE$8:$AE$160)*($F$6=$AD$8:$AD$160),0),$D$3)","v":"BHR"},{"$nulls":17},47,"HHH",{"$f":"HHH!D22","v":"Paul Cousins"},{"$f":"HHH!E22","v":"00:35:57"},{"$f":"HHH!H22","v":"M V"},23]
[48,{"$nulls":4},{"$f":"INDEX($AA$8:$AE$160,MATCH(1,($A55=$AE$8:$AE$160)*($F$6=$AD$8:$AD$160),0),$B$3)","v":"Phil Grabsky "},{"$f":"INDEX($AA$8:$AE$160,MATCH(1,($A55=$AE$8:$AE$160)*($F$6=$AD$8:$AD$160),0),$C$3)","v":"01:00:42"},{"$f":"INDEX($AA$8:$AE$160,MATCH(1,($A55=$AE$8:$AE$160)*($F$6=$AD$8:$AD$160),0),$D$3)","v":"PHX"},{"$nulls":17},48,"PHX",{"$f":"Phoenix!D26","v":"Erica Martin "},{"$f":"Phoenix!E26","v":"00:36:06"},{"$f":"Phoenix!H26","v":"F S"},2]
[49,{"$nulls":4},{"$f":"INDEX($AA$8:$AE$160,MATCH(1,($A56=$AE$8:$AE$160)*($F$6=$AD$8:$AD$160),0),$B$3)","v":"Richard Thompson "},{"$f":"INDEX($AA$8:$AE$160,MATCH(1,($A56=$AE$8:$AE$160)*($F$6=$AD$8:$AD$160),0),$C$3)","v":"01:01:36"},{"$f":"INDEX($AA$8:$AE$160,MATCH(1,($A56=$AE$8:$AE$160)*($F$6=$AD$8:$AD$160),0),$D$3)","v":"PHX"},{"$nulls":17},49,"HHH",{"$f":"HHH!D23","v":"Julian Boyer"},{"$f":"HHH!E23","v":"00:36:14"},{"$f":"HHH!H23","v":"M V"},24]
[50,{"$nulls":4},{"$f":"INDEX($AA$8:$AE$160,MATCH(1,($A57=$AE$8:$AE$160)*($F$6=$AD$8:$AD$160),0),$B$3)","v":{"$error":"#N/A"}},{"$f":"INDEX($AA$8:$AE$160,MATCH(1,($A57=$AE$8:$AE$160)*($F$6=$AD$8:$AD$160),0),$C$3)","v":{"$error":"#N/A"}},{"$f":"INDEX($AA$8:$AE$160,MATCH(1,($A57=$AE$8:$AE$160)*($F$6=$AD$8:$AD$160),0),$D$3)","v":{"$error":"#N/A"}},{"$nulls":17},50,"HHH",{"$f":"HHH!D24","v":"Kai Robinson"},{"$f":"HHH!E24","v":"00:36:32"},{"$f":"HHH!H24","v":"M S"},23]
[{"$nulls":25},51,"HHH",{"$f":"HHH!D25","v":"Dave Warren"},{"$f":"HHH!E25","v":"00:36:34"},{"$f":"HHH!H25","v":"M V"},25]
[{"$nulls":25},52,"PHX",{"$f":"Phoenix!D27","v":"Barry Blackwell "},{"$f":"Phoenix!E27","v":"00:36:40"},{"$f":"Phoenix!H27","v":"M V"},26]
[{"$nulls":25},53,"HHH",{"$f":"HHH!D26","v":"Russell Mullen"},{"$f":"HHH!E26","v":"00:36:52"},{"$f":"HHH!H26","v":"M S"},24]
[{"$nulls":25},54,"PHX",{"$f":"Phoenix!D28","v":"Samantha Leader "},{"$f":"Phoenix!E28","v":"00:37:03"},{"$f":"Phoenix!H28","v":"F V"},1]
[{"$nulls":25},55,"PHX",{"$f":"Phoenix!D29","v":"Andy Bone "},{"$f":"Phoenix!E29","v":"00:37:12"},{"$f":"Phoenix!H29","v":"M V"},27]
[{"$nulls":25},56,"PHX",{"$f":"Phoenix!D30","v":"Cat Bounds "},{"$f":"Phoenix!E30","v":"00:37:22"},{"$f":"Phoenix!H30","v":"F S"},3]
[{"$nulls":25},57,"Lewes",{"$f":"LewesAC!D15","v":"Helen Sida"},{"$f":"LewesAC!E15","v":"00:37:39"},{"$f":"LewesAC!H15","v":"F V"},2,"tied"]
[{"$nulls":25},58,"Lewes",{"$f":"LewesAC!D16","v":"Michael Ussher"},{"$f":"LewesAC!E16","v":"00:37:39"},{"$f":"LewesAC!H16","v":"M V"},28,"tied"]
[{"$nulls":25},59,"PHX",{"$f":"Phoenix!D31","v":"Andrew Haslam "},{"$f":"Phoenix!E31","v":"00:37:50"},{"$f":"Phoenix!H31","v":"M S"},25]
[{"$nulls":25},60,"BHR",{"$f":"BHR!D11","v":"Ian Jones "},{"$f":"BHR!E11","v":"00:37:54"},{"$f":"BHR!H11","v":"M V"},29]
[{"$nulls":25},61,"HHH",{"$f":"HHH!D27","v":"Andy Dray"},{"$f":"HHH!E27","v":"00:37:56"},{"$f":"HHH!H27","v":"M V"},30]
[{"$nulls":25},62,"HHH",{"$f":"HHH!D28","v":"Kim Lo"},{"$f":"HHH!E28","v":"00:38:08"},{"$f":"HHH!H28","v":"F S"},4]
[{"$nulls":25},63,"HHH",{"$f":"HHH!D29","v":"Tim Hicks"},{"$f":"HHH!E29","v":"00:38:11"},{"$f":"HHH!H29","v":"M SV"},2]
[{"$nulls":25},64,"HHH",{"$f":"HHH!D30","v":"Siobhan Amer"},{"$f":"HHH!E30","v":"00:38:16"},{"$f":"HHH!H30","v":"F V"},3]
[{"$nulls":25},65,"PHX",{"$f":"Phoenix!D32","v":"Sibel Recber "},{"$f":"Phoenix!E32","v":"00:38:22"},{"$f":"Phoenix!H32","v":"F S"},{"$f":"COUNTIFS($AD$8:$AD$160,AD72,$AC$8:$AC$160,\"<\"&AC72)+1","v":5}]
[{"$nulls":25},66,"Lewes",{"$f":"LewesAC!D17","v":"Mauro Lazzati"},{"$f":"LewesAC!E17","v":"00:38:26"},{"$f":"LewesAC!H17","v":"M V"},31]
[{"$nulls":25},67,"Lewes",{"$f":"LewesAC!D18","v":"David Prince-Iles"},{"$f":"LewesAC!E18","v":"00:38:27"},{"$f":"LewesAC!H18","v":"M SV"},3]
[{"$nulls":25},68,"PHX",{"$f":"Phoenix!D33","v":"Andy Pumphrey "},{"$f":"Phoenix!E33","v":"00:38:28"},{"$f":"Phoenix!H33","v":"M V"},32]
[{"$nulls":25},69,"PHX",{"$f":"Phoenix!D34","v":"Sara Burns "},{"$f":"Phoenix!E34","v":"00:38:29"},{"$f":"Phoenix!H34","v":"F V"},4]
[{"$nulls":25},70,"HHH",{"$f":"HHH!D31","v":"Chris Faulkner"},{"$f":"HHH!E31","v":"00:38:32"},{"$f":"HHH!H31","v":"M V"},33]
[{"$nulls":25},71,"PHX",{"$f":"Phoenix!D35","v":"Emily Budd "},{"$f":"Phoenix!E35","v":"00:38:37"},{"$f":"Phoenix!H35","v":"F S"},6]
[{"$nulls":25},72,"BHR",{"$f":"BHR!D12","v":"Jamie Goodhead"},{"$f":"BHR!E12","v":"00:38:39"},{"$f":"BHR!H12","v":"M V"},34,"tied"]
[{"$nulls":25},73,"HHH",{"$f":"HHH!D32","v":"Ian Dumbrell"},{"$f":"HHH!E32","v":"00:38:39.010"},{"$f":"HHH!H32","v":"M V"},35,"tied"]
[{"$nulls":25},74,"HHH",{"$f":"HHH!D33","v":"Jason Robinson"},{"$f":"HHH!E33","v":"00:38:48"},{"$f":"HHH!H33","v":"M V"},36]
[{"$nulls":25},75,"Lewes",{"$f":"LewesAC!D19","v":"Rob Stanway"},{"$f":"LewesAC!E19","v":"00:39:01"},{"$f":"LewesAC!H19","v":"M V"},37]
[{"$nulls":25},76,"PHX",{"$f":"Phoenix!D36","v":"Andrew Brooks "},{"$f":"Phoenix!E36","v":"00:39:09"},{"$f":"Phoenix!H36","v":"M V"},38]
[{"$nulls":25},77,"PHX",{"$f":"Phoenix!D37","v":"Chelsey Hallam "},{"$f":"Phoenix!E37","v":"00:39:36"},{"$f":"Phoenix!H37","v":"F S"},7]
[{"$nulls":25},78,"Lewes",{"$f":"LewesAC!D20","v":"Mat Homewood"},{"$f":"LewesAC!E20","v":"00:39:37"},{"$f":"LewesAC!H20","v":"M V"},39]
[{"$nulls":25},79,"HHH",{"$f":"HHH!D34","v":"Matt Howells"},{"$f":"HHH!E34","v":"00:39:39"},{"$f":"HHH!H34","v":"M S"},26,"tied"]
[{"$nulls":25},80,"Lewes",{"$f":"LewesAC!D21","v":"David Foster"},{"$f":"LewesAC!E21","v":"00:39:39"},{"$f":"LewesAC!H21","v":"M V"},40,"tied"]
[{"$nulls":25},81,"Lewes",{"$f":"LewesAC!D22","v":"Ellen Brookes"},{"$f":"LewesAC!E22","v":"00:39:39"},{"$f":"LewesAC!H22","v":"F S"},8,"tied"]
[{"$nulls":25},82,"Lewes",{"$f":"LewesAC!D23","v":"Tamsyn d'Arienzo"},{"$f":"LewesAC!E23","v":"00:39:45"},{"$f":"LewesAC!H23","v":"F S"},9]
[{"$nulls":25},83,"PHX",{"$f":"Phoenix!D38","v":"Mike Townley "},{"$f":"Phoenix!E38","v":"00:39:55"},{"$f":"Phoenix!H38","v":"M V"},41]
[{"$nulls":25},84,"PHX",{"$f":"Phoenix!D39","v":"Geoff Manns "},{"$f":"Phoenix!E39","v":"00:39:58"},{"$f":"Phoenix!H39","v":"M V"},42]
[{"$nulls":25},85,"PHX",{"$f":"Phoenix!D40","v":"Georgie Anderson "},{"$f":"Phoenix!E40","v":"00:39:59"},{"$f":"Phoenix!H40","v":"F S"},10]
[{"$nulls":25},86,"PHX",{"$f":"Phoenix!D41","v":"Dan Allen "},{"$f":"Phoenix!E41","v":"00:40:00"},{"$f":"Phoenix!H41","v":"M SV"},4]
[{"$nulls":25},87,"PHX",{"$f":"Phoenix!D42","v":"Jess Stribbling "},{"$f":"Phoenix!E42","v":"00:40:05"},{"$f":"Phoenix!H42","v":"F S"},11]
[{"$nulls":25},88,"PHX",{"$f":"Phoenix!D43","v":"Amelia Culshaw "},{"$f":"Phoenix!E43","v":"00:41:10"},{"$f":"Phoenix!H43","v":"F V"},5]
[{"$nulls":25},89,"PHX",{"$f":"Phoenix!D44","v":"Rachel Gorman "},{"$f":"Phoenix!E44","v":"00:41:13"},{"$f":"Phoenix!H44","v":"F S"},12]
[{"$nulls":25},90,"HHH",{"$f":"HHH!D35","v":"Olivia Treharne"},{"$f":"HHH!E35","v":"00:41:43"},{"$f":"HHH!H35","v":"F S"},13]
[{"$nulls":25},91,"HHH",{"$f":"HHH!D36","v":"Peter Harding"},{"$f":"HHH!E36","v":"00:42:05"},{"$f":"HHH!H36","v":"M V"},43]
[{"$nulls":25},92,"Lewes",{"$f":"LewesAC!D24","v":"Gerard Dummett "},{"$f":"LewesAC!E24","v":"00:42:37"},{"$f":"LewesAC!H24","v":"M SV"},5]
[{"$nulls":25},93,"HHH",{"$f":"HHH!D37","v":"Katherine Buckeridge"},{"$f":"HHH!E37","v":"00:42:45"},{"$f":"HHH!H37","v":"F V"},6]
[{"$nulls":25},94,"HHH",{"$f":"HHH!D38","v":"Liz Earley"},{"$f":"HHH!E38","v":"00:42:54"},{"$f":"HHH!H38","v":"F S"},14,"tied"]
[{"$nulls":25},95,"HHH",{"$f":"HHH!D39","v":"Sarah King"},{"$f":"HHH!E39","v":"00:42:54.010"},{"$f":"HHH!H39","v":"F S"},15,"tied"]
[{"$nulls":25},96,"PHX",{"$f":"Phoenix!D45","v":"Liz Halliday "},{"$f":"Phoenix!E45","v":"00:42:56"},{"$f":"Phoenix!H45","v":"F V"},7]
[{"$nulls":25},97,"BHR",{"$f":"BHR!D13","v":"Flo Wolfe"},{"$f":"BHR!E13","v":"00:42:57"},{"$f":"BHR!H13","v":"F S"},{"$f":"COUNTIFS($AD$8:$AD$160,AD104,$AC$8:$AC$160,\"<\"&AC104)+1","v":16}]
[{"$nulls":25},98,"HHH",{"$f":"HHH!D40","v":"Josh Franks"},{"$f":"HHH!E40","v":"00:43:10"},{"$f":"HHH!H40","v":"M S"},27,"tied"]
[{"$nulls":25},99,"BHR",{"$f":"BHR!D14","v":"Stuart Condie"},{"$f":"BHR!E14","v":"00:43:10"},{"$f":"BHR!H14","v":"M SV"},6,"tied"]
[{"$nulls":25},100,"HHH",{"$f":"HHH!D41","v":"Lydia Levy"},{"$f":"HHH!E41","v":"00:43:16"},{"$f":"HHH!H41","v":"F S"},17]
[{"$nulls":25},101,"HHH",{"$f":"HHH!D42","v":"Gemma Morgan"},{"$f":"HHH!E42","v":"00:43:17"},{"$f":"HHH!H42","v":"F S"},18]
[{"$nulls":25},102,"HHH",{"$f":"HHH!D43","v":"Mark Sykes"},{"$f":"HHH!E43","v":"00:43:26"},{"$f":"HHH!H43","v":"M SV"},7]
[{"$nulls":25},103,"Lewes",{"$f":"LewesAC!D25","v":"Peter Kennedy"},{"$f":"LewesAC!E25","v":"00:43:32"},{"$f":"LewesAC!H25","v":"M SV"},8]
[{"$nulls":25},104,"Lewes",{"$f":"LewesAC!D26","v":"Beth Hancock"},{"$f":"LewesAC!E26","v":"00:43:48"},{"$f":"LewesAC!H26","v":"F S"},19]
[{"$nulls":25},105,"PHX",{"$f":"Phoenix!D46","v":"Val Avella "},{"$f":"Phoenix!E46","v":"00:44:08"},{"$f":"Phoenix!H46","v":"F S"},20]
[{"$nulls":25},106,"Lewes",{"$f":"LewesAC!D27","v":"Ian Hilder"},{"$f":"LewesAC!E27","v":"00:44:13"},{"$f":"LewesAC!H27","v":"M SV"},9]
[{"$nulls":25},107,"PHX",{"$f":"Phoenix!D47","v":"Andrew Haig "},{"$f":"Phoenix!E47","v":"00:44:16"},{"$f":"Phoenix!H47","v":"M SV"},10]
[{"$nulls":25},108,"Lewes",{"$f":"LewesAC!D28","v":"Andy Perris"},{"$f":"LewesAC!E28","v":"00:44:19"},{"$f":"LewesAC!H28","v":"M V"},44]
[{"$nulls":25},109,"BHR",{"$f":"BHR!D15","v":"Steve Barrett"},{"$f":"BHR!E15","v":"00:44:52"},{"$f":"BHR!H15","v":"M S"},28]
[{"$nulls":25},110,"BHR",{"$f":"BHR!D16","v":"Richard Light"},{"$f":"BHR!E16","v":"00:45:25"},{"$f":"BHR!H16","v":"M SV"},11]
[{"$nulls":25},111,"Lewes",{"$f":"LewesAC!D29","v":"Helen Bowman"},{"$f":"LewesAC!E29","v":"00:45:37"},{"$f":"LewesAC!H29","v":"F V"},8]
[{"$nulls":25},112,"HHH",{"$f":"HHH!D44","v":"Shelagh Robinson"},{"$f":"HHH!E44","v":"00:45:40"},{"$f":"HHH!H44","v":"F V"},9]
[{"$nulls":25},113,"HHH",{"$f":"HHH!D45","v":"Amy Lovejoy"},{"$f":"HHH!E45","v":"00:45:41"},{"$f":"HHH!H45","v":"F S"},21]
[{"$nulls":25},114,"HHH",{"$f":"HHH!D46","v":"Carl Bicknell"},{"$f":"HHH!E46","v":"00:46:24"},{"$f":"HHH!H46","v":"M V"},45]
[{"$nulls":25},115,"Lewes",{"$f":"LewesAC!D30","v":"Mark Pappenheim"},{"$f":"LewesAC!E30","v":"00:46:30"},{"$f":"LewesAC!H30","v":"M SV"},12]
[{"$nulls":25},116,"BHR",{"$f":"BHR!D17","v":"Thomas Peel-Yates"},{"$f":"BHR!E17","v":"00:46:43"},{"$f":"BHR!H17","v":"M V"},46]
[{"$nulls":25},117,"Lewes",{"$f":"LewesAC!D31","v":"Bob Hughes"},{"$f":"LewesAC!E31","v":"00:46:45"},{"$f":"LewesAC!H31","v":"M SV"},13]
[{"$nulls":25},118,"HHH",{"$f":"HHH!D47","v":"Jacqueline Barnes"},{"$f":"HHH!E47","v":"00:46:47"},{"$f":"HHH!H47","v":"F V"},10]
[{"$nulls":25},119,"BHR",{"$f":"BHR!D18","v":"Mercy Dennis-Smith"},{"$f":"BHR!E18","v":"00:46:50"},{"$f":"BHR!H18","v":"F S"},22]
[{"$nulls":25},120,"Lewes",{"$f":"LewesAC!D32","v":"Ruth Wray"},{"$f":"LewesAC!E32","v":"00:47:03"},{"$f":"LewesAC!H32","v":"F V"},11]
[{"$nulls":25},121,"Lewes",{"$f":"LewesAC!D33","v":"Hugh St John"},{"$f":"LewesAC!E33","v":"00:47:16"},{"$f":"LewesAC!H33","v":"M SV"},14,"tied"]
[{"$nulls":25},122,"Lewes",{"$f":"LewesAC!D34","v":"Andrew Chitty"},{"$f":"LewesAC!E34","v":"00:47:16.010"},{"$f":"LewesAC!H34","v":"M SV"},15,"tied"]
[{"$nulls":25},123,"PHX",{"$f":"Phoenix!D48","v":"Lisa Ebdon "},{"$f":"Phoenix!E48","v":"00:47:31"},{"$f":"Phoenix!H48","v":"F V"},12]
[{"$nulls":25},124,"Lewes",{"$f":"LewesAC!D35","v":"Colin Hartland"},{"$f":"LewesAC!E35","v":"00:47:43"},{"$f":"LewesAC!H35","v":"M SV"},16]
[{"$nulls":25},125,"BHR",{"$f":"BHR!D19","v":"Cameron Cooper"},{"$f":"BHR!E19","v":"00:47:57"},{"$f":"BHR!H19","v":"M S"},29]
[{"$nulls":25},126,"HHH",{"$f":"HHH!D48","v":"Marion Hemsworth"},{"$f":"HHH!E48","v":"00:48:20"},{"$f":"HHH!H48","v":"F SV"},1]
[{"$nulls":25},127,"BHR",{"$f":"BHR!D20","v":"Bill Whitehead"},{"$f":"BHR!E20","v":"00:48:24"},{"$f":"BHR!H20","v":"M V"},47]
[{"$nulls":25},128,"Lewes",{"$f":"LewesAC!D36","v":"Fran Witt"},{"$f":"LewesAC!E36","v":"00:48:51"},{"$f":"LewesAC!H36","v":"F V"},13]
[{"$nulls":25},129,"PHX",{"$f":"Phoenix!D49","v":"Sarah Russell "},{"$f":"Phoenix!E49","v":"00:48:54"},{"$f":"Phoenix!H49","v":"F V"},{"$f":"COUNTIFS($AD$8:$AD$160,AD136,$AC$8:$AC$160,\"<\"&AC136)+1","v":14}]
[{"$nulls":25},130,"Lewes",{"$f":"LewesAC!D37","v":"Anne Hagan"},{"$f":"LewesAC!E37","v":"00:49:24"},{"$f":"LewesAC!H37","v":"F SV"},2]
[{"$nulls":25},131,"BHR",{"$f":"BHR!D21","v":"Nicky Callus"},{"$f":"BHR!E21","v":"00:49:35"},{"$f":"BHR!H21","v":"F SV"},3]
[{"$nulls":25},132,"PHX",{"$f":"Phoenix!D50","v":"Jude Matthews "},{"$f":"Phoenix!E50","v":"00:49:49"},{"$f":"Phoenix!H50","v":"F SV"},4]
[{"$nulls":25},133,"PHX",{"$f":"Phoenix!D51","v":"Eogan McKenna "},{"$f":"Phoenix!E51","v":"00:49:56"},{"$f":"Phoenix!H51","v":"M SV"},17]
[{"$nulls":25},134,"Lewes",{"$f":"LewesAC!D38","v":"Anita Amies"},{"$f":"LewesAC!E38","v":"00:50:13"},{"$f":"LewesAC!H38","v":"F SV"},5]
[{"$nulls":25},135,"BHR",{"$f":"BHR!D22","v":"Chris Hine"},{"$f":"BHR!E22","v":"00:50:35"},{"$f":"BHR!H22","v":"M S"},30]
[{"$nulls":25},136,"HHH",{"$f":"HHH!D49","v":"Linda Tullett"},{"$f":"HHH!E49","v":"00:50:41"},{"$f":"HHH!H49","v":"F V"},15]
[{"$nulls":25},137,"HHH",{"$f":"HHH!D50","v":"Carys Hind"},{"$f":"HHH!E50","v":"00:50:55"},{"$f":"HHH!H50","v":"F S"},23]
[{"$nulls":25},138,"BHR",{"$f":"BHR!D23","v":"Emma Buckland"},{"$f":"BHR!E23","v":"00:51:00"},{"$f":"BHR!H23","v":"F V"},16]
[{"$nulls":25},139,"PHX",{"$f":"Phoenix!D52","v":"Rik Taub "},{"$f":"Phoenix!E52","v":"00:51:06"},{"$f":"Phoenix!H52","v":"M SV"},18,"tied"]
[{"$nulls":25},140,"PHX",{"$f":"Phoenix!D53","v":"Malcolm Kemp "},{"$f":"Phoenix!E53","v":"00:51:06"},{"$f":"Phoenix!H53","v":"M SV"},19,"tied"]
[{"$nulls":25},141,"BHR",{"$f":"BHR!D24","v":"Pete Brownlie"},{"$f":"BHR!E24","v":"00:51:40"},{"$f":"BHR!H24","v":"M SV"},20]
[{"$nulls":25},142,"BHR",{"$f":"BHR!D25","v":"Christelle Maugiron"},{"$f":"BHR!E25","v":"00:51:47"},{"$f":"BHR!H25","v":"F S"},24]
[{"$nulls":25},143,"BHR",{"$f":"BHR!D26","v":"Kim Gow"},{"$f":"BHR!E26","v":"00:52:53"},{"$f":"BHR!H26","v":"F SV"},6]
[{"$nulls":25},144,"Lewes",{"$f":"LewesAC!D39","v":"Emma Hodgson"},{"$f":"LewesAC!E39","v":"00:53:27"},{"$f":"LewesAC!H39","v":"F V"},17]
[{"$nulls":25},145,"Lewes",{"$f":"LewesAC!D40","v":"Emma Gardner"},{"$f":"LewesAC!E40","v":"00:54:04"},{"$f":"LewesAC!H40","v":"F V"},18]
[{"$nulls":25},146,"Lewes",{"$f":"LewesAC!D41","v":"Naomi Ross"},{"$f":"LewesAC!E41","v":"00:54:10"},{"$f":"LewesAC!H41","v":"F S"},25]
[{"$nulls":25},147,"Lewes",{"$f":"LewesAC!D42","v":"Julie Deakin "},{"$f":"LewesAC!E42","v":"00:54:12"},{"$f":"LewesAC!H42","v":"F V"},19]
[{"$nulls":25},148,"PHX",{"$f":"Phoenix!D54","v":"Ella Grabsky "},{"$f":"Phoenix!E54","v":"01:00:42"},{"$f":"Phoenix!H54","v":"F S"},26,"tied"]
[{"$nulls":25},149,"PHX",{"$f":"Phoenix!D55","v":"Phil Grabsky "},{"$f":"Phoenix!E55","v":"01:00:42"},{"$f":"Phoenix!H55","v":"M V"},48,"tied"]
[{"$nulls":25},150,"PHX",{"$f":"Phoenix!D56","v":"Richard Thompson "},{"$f":"Phoenix!E56","v":"01:01:36"},{"$f":"Phoenix!H56","v":"M V"},49]
[{"$nulls":25},151,"BHR",{"$f":"BHR!D27","v":"David Clark"},{"$f":"BHR!E27","v":"01:01:54"},{"$f":"BHR!H27","v":"M SV"},21]
[{"$nulls":25},152,"BHR",{"$f":"BHR!D28","v":"Isabelle Adlam"},{"$f":"BHR!E28","v":"01:15:00"},{"$f":"BHR!H28","v":"F S"},27]
[{"$nulls":25},153,"BHR",{"$f":"BHR!D29","v":"Eileen Adlam"},{"$f":"BHR!E29","v":"01:18:08"},{"$f":"BHR!H29","v":"F V"},20]

{"sheet":"HHH","index":2,"n_rows":73,"n_cols":51,"rows_kept":73,"merged":[[1,29,1,33],[3,10,3,18],[3,20,3,27],[72,20,72,27]]}
[{"$nulls":3},{"$f":"MID(CELL(\"filename\",A1),FIND(\"]\",CELL(\"filename\",A1))+1,255)","v":"HHH"}]
[{"$nulls":6},"S","=to V44",{"$nulls":3},1,2,3,4,5,6,7,8,{"$nulls":10},"Team Time"]
[{"$nulls":6},"V","= V45-V59"]
[{"$nulls":6},"SV","=V60+",null,null,"Team allocation",{"$nulls":9},"Correction factors",{"$nulls":8},{"$f":"SUM(AD7:AD69)","v":0.15531261574074073},{"$f":"SUM(AE7:AE69)","v":0.16415192592592592},0.17008687037037037,0.17304339185185183,0.18006149305555552,0.18248765046296297,0.19154981481481484,0.18727002314814817]
[]
[null,null,"posn",null,"time","Gender","Age cat","Gen/Age","rank in cat",null,null,"Team A","Team B","Team C","Team D","Team E","Team F","Team G","Team H",null,"Team A","Team B","Team C","Team D","Team E","Team F","Team G","Team H",null,"Team A","Team B","Team C","Team D","Team E","Team F","Team G","Team H",{"$nulls":8},"name","time","cat","cat rank","Gender","age grp"]
[null,null,1,{"$f":"AT7","v":"Ben Gibson"},{"$f":"AU7","v":"00:29:18"},{"$f":"AX7","v":"M"},{"$f":"AY7","v":"S"},{"$f":"F7&\" \"&G7","v":"M S"},{"$f":"COUNTIFS($H$7:$H$59,H7,$E$7:$E$59,\"<\"&E7)+1","v":1},{"$f":"COUNTA(L7:S7)","v":1},null,1,{"$nulls":8},{"$f":"IF(ISBLANK(L7)=TRUE(),\"\",IF(ISNUMBER(L7)=TRUE(),1,\"overwrite manually\"))","v":1},"","","","","",{"$f":"IF(ISBLANK(R7)=TRUE(),\"\",IF(ISNUMBER(R7)=TRUE(),1,\"overwrite manually\"))","v":""},"",null,{"$f":"IFERROR(U7*$E7,\"\")","v":"00:29:18"},"","","","","",{"$f":"IFERROR(AA7*$E7,\"\")","v":""},"",{"$nulls":7},1,"Ben Gibson","00:29:18","mU45",1,"M","S"]
[null,null,2,"James Collins","00:29:46","M","S",{"$f":"F8&\" \"&G8","v":"M S"},{"$f":"COUNTIFS($H$7:$H$59,H8,$E$7:$E$59,\"<\"&E8)+1","v":2},{"$f":"COUNTA(L8:S8)","v":1},null,null,2,{"$nulls":7},{"$f":"IF(ISBLANK(L8)=TRUE(),\"\",IF(ISNUMBER(L8)=TRUE(),1,\"overwrite manually\"))","v":""},{"$f":"IF(ISBLANK(M8)=TRUE(),\"\",IF(ISNUMBER(M8)=TRUE(),1,\"overwrite manually\"))","v":1},{"$f":"IF(ISBLANK(N8)=TRUE(),\"\",IF(ISNUMBER(N8)=TRUE(),1,\"overwrite manually\"))","v":""},{"$f":"IF(ISBLANK(O8)=TRUE(),\"\",IF(ISNUMBER(O8)=TRUE(),1,\"overwrite manually\"))","v":""},{"$f":"IF(ISBLANK(P8)=TRUE(),\"\",IF(ISNUMBER(P8)=TRUE(),1,\"overwrite manually\"))","v":""},{"$f":"IF(ISBLANK(Q8)=TRUE(),\"\",IF(ISNUMBER(Q8)=TRUE(),1,\"overwrite manually\"))","v":""},{"$f":"IF(ISBLANK(R8)=TRUE(),\"\",IF(ISNUMBER(R8)=TRUE(),1,\"overwrite manually\"))","v":""},{"$f":"IF(ISBLANK(S8)=TRUE(),\"\",IF(ISNUMBER(S8)=TRUE(),1,\"overwrite manually\"))","v":""},null,{"$f":"IFERROR(U8*$E8,\"\")","v":""},"00:29:46","","","",{"$f":"IFERROR(Z8*$E8,\"\")","v":""},{"$f":"IFERROR(AA8*$E8,\"\")","v":""},{"$f":"IFERROR(AB8*$E8,\"\")","v":""},{"$nulls":7},2,"James Collins","00:29:46","mU45",2,"M","S"]
[null,null,3,"Marcus Kimmins","00:31:26.010","M","V","M V",1,1,null,1,{"$nulls":8},1,"","","","","","","",null,"00:31:26.010","","","","","","","",{"$nulls":7},3,"Marcus Kimmins","00:31:26.010","mU60",1,"M","V"]
[null,null,4,"Phil Payne","00:32:24","M","S","M S",3,1,{"$nulls":3},3,{"$nulls":6},"","",1,"","","","","",null,"","","00:32:24","","","","","",{"$nulls":7},4,"Phil Payne","00:32:24","mU45",3,"M","S"]
[null,null,5,"Andy Hind","00:32:26","M","V","M V",2,1,null,null,2,{"$nulls":7},"",1,"","","","","","",null,"","00:32:26","","","","","","",{"$nulls":7},5,"Andy Hind","00:32:26","mU60",2,"M","V"]
[null,null,6,"James Moffat","00:32:36","M","V","M V",3,1,{"$nulls":3},3,{"$nulls":6},"","",1,"","","","","",null,"","","00:32:36","","","","","",{"$nulls":7},6,"James Moffat","00:32:36","mU60",3,"M","V"]
[null,null,7,"Matt Cook","00:32:45","M","S","M S",4,1,{"$nulls":4},4,{"$nulls":5},"","","",1,"","","","",null,"","","","00:32:45","","","","",{"$nulls":7},7,"Matt Cook","00:32:45","mU45",4,"M","S"]
[null,null,8,"Matthew King","00:33:39","M","S","M S",5,1,{"$nulls":5},5,{"$nulls":4},"","","","",1,"","","",null,"","","","","00:33:39","","","",{"$nulls":7},8,"Matthew King","00:33:39","mU45",5,"M","S"]
[null,null,9,"Michael Burke","00:33:57","M","S","M S",6,1,{"$nulls":6},6,{"$nulls":3},"","","","","",1,"","",null,{"$f":"IFERROR(U15*$E15,\"\")","v":""},{"$f":"IFERROR(V15*$E15,\"\")","v":""},{"$f":"IFERROR(W15*$E15,\"\")","v":""},{"$f":"IFERROR(X15*$E15,\"\")","v":""},{"$f":"IFERROR(Y15*$E15,\"\")","v":""},"00:33:57","","",{"$nulls":7},9,"Michael Burke","00:33:57","mU45",6,"M","S"]
[null,null,10,"Tim Miller","00:34:11","M","V","M V",4,1,{"$nulls":4},4,{"$nulls":5},"","","",1,"","","","",null,"","","","00:34:11","","","","",{"$nulls":7},10,"Tim Miller","00:34:11","mU60",4,"M","V"]
[null,null,11,"Peter Francis","00:34:12","M","S","M S",7,1,{"$nulls":7},7,null,null,"","","","","","",1,"",null,"","","","","","","00:34:12","",{"$nulls":7},11,"Peter Francis","00:34:12","mU45",7,"M","S"]
[null,null,12,"Barry Tullett","00:34:53","M","V","M V",5,1,{"$nulls":5},5,{"$nulls":4},"","","","",1,"","","",null,"","","","","00:34:53","","","",{"$nulls":7},12,"Barry Tullett","00:34:53","mU60",5,"M","V"]
[null,null,13,"Gregory Hilton","00:35:09","M","S","M S",8,1,{"$nulls":8},8,null,"","","","","","","",1,null,"","","","","","","","00:35:09",{"$nulls":7},13,"Gregory Hilton","00:35:09","mU45",8,"M","S"]
[null,null,14,"Simeon Wishlade","00:35:31","M","S","M S",9,1,{"$nulls":5},"as F SV",{"$nulls":4},"","","","",1.4238,"","","",null,{"$f":"IFERROR(U20*$E20,\"\")","v":""},{"$f":"IFERROR(V20*$E20,\"\")","v":""},{"$f":"IFERROR(W20*$E20,\"\")","v":""},{"$f":"IFERROR(X20*$E20,\"\")","v":""},{"$f":"IFERROR(Y20*$E20,\"\")","v":"00:50:34.118"},{"$f":"IFERROR(Z20*$E20,\"\")","v":""},{"$f":"IFERROR(AA20*$E20,\"\")","v":""},{"$f":"IFERROR(AB20*$E20,\"\")","v":""},{"$nulls":7},14,"Simeon Wishlade","00:35:31","mU45",9,"M","S"]
[null,null,15,"Simon Robinson","00:35:32","M","V","M V",6,1,{"$nulls":6},6,{"$nulls":3},"","","","","",1,"","",null,"","","","","","00:35:32","","",{"$nulls":7},15,"Simon Robinson","00:35:32","mU60",6,"M","V"]
[null,null,16,"Paul Cousins","00:35:57","M","V","M V",7,1,{"$nulls":7},7,null,null,"","","","","","",1,"",null,"","","","","","","00:35:57","",{"$nulls":7},16,"Paul Cousins","00:35:57","mU60",7,"M","V"]
[null,null,17,"Julian Boyer","00:36:14","M","V","M V",8,1,{"$nulls":8},8,null,"","","","","","","",1,null,"","","","","","","","00:36:14",{"$nulls":7},17,"Julian Boyer","00:36:14","mU60",8,"M","V"]
[null,null,18,"Kai Robinson","00:36:32","M","S","M S",10,1,{"$nulls":5},"as M SV",{"$nulls":4},"","",{"$f":"IF(ISBLANK(N24)=TRUE(),\"\",IF(ISNUMBER(N24)=TRUE(),1,\"overwrite manually\"))","v":""},{"$f":"IF(ISBLANK(O24)=TRUE(),\"\",IF(ISNUMBER(O24)=TRUE(),1,\"overwrite manually\"))","v":""},1.2656,{"$f":"IF(ISBLANK(Q24)=TRUE(),\"\",IF(ISNUMBER(Q24)=TRUE(),1,\"overwrite manually\"))","v":""},{"$f":"IF(ISBLANK(R24)=TRUE(),\"\",IF(ISNUMBER(R24)=TRUE(),1,\"overwrite manually\"))","v":""},"",null,"","","","","00:46:14.195","","","",{"$nulls":7},18,"Kai Robinson","00:36:32","mU45",10,"M","S"]
[null,null,19,"Dave Warren","00:36:34","M","V","M V",9,1,null,null,"as F SV",{"$nulls":7},"",1.2656,"","",{"$f":"IF(ISBLANK(P25)=TRUE(),\"\",IF(ISNUMBER(P25)=TRUE(),1,\"overwrite manually\"))","v":""},"","","",null,"","00:46:16.726","","","","","","",{"$nulls":7},19,"Dave Warren","00:36:34","mU60",9,"M","V"]
[null,null,20,"Russell Mullen","00:36:52","M","S","M S",11,1,{"$nulls":6},"as F SV",{"$nulls":3},"","","","","",1.4238,"","",null,"","","","","","00:52:29.446","","",{"$nulls":7},20,"Russell Mullen","00:36:52","mU45",11,"M","S"]
[null,null,21,"Andy Dray","00:37:56","M","V","M V",10,1,{"$nulls":3},"as F SV",{"$nulls":6},"","",1.2656,"","","","","",null,"","","00:48:00.506","","","","","",{"$nulls":7},21,"Andy Dray","00:37:56","mU60",10,"M","V"]
[null,null,22,"Kim Lo","00:38:08","F","S","F S",1,1,null,1,{"$nulls":8},1,"","","","","","","",null,"00:38:08","","","","","","","",{"$nulls":7},22,"Kim Lo","00:38:08","fU45",1,"F","S"]
[null,null,23,"Tim Hicks","00:38:11","M","SV","M SV",1,1,null,1,{"$nulls":8},1,"","","","","","","",null,"00:38:11","","","","","","","",{"$nulls":7},23,"Tim Hicks","00:38:11","mO60",1,"M","SV"]
[null,null,24,"Siobhan Amer","00:38:16","F","V","F V",1,1,null,1,{"$nulls":8},1,"","","","","","","",null,"00:38:16","","","","","","","",{"$nulls":7},24,"Siobhan Amer","00:38:16","fU60",1,"F","V"]
[null,null,25,"Chris Faulkner","00:38:32","M","V","M V",11,1,{"$nulls":3},"as M SV",{"$nulls":6},"","",1.125,"","","","","",null,"","","00:43:21","","","","","",{"$nulls":7},25,"Chris Faulkner","00:38:32","mU60",11,"M","V"]
[null,null,26,"Ian Dumbrell","00:38:39.010","M","V","M V",12,1,{"$nulls":4},"as F SV",{"$nulls":5},"","","",1.2656,"","","","",null,"","","","00:48:54.939","","","","",{"$nulls":7},26,"Ian Dumbrell","00:38:39.010","mU60",12,"M","V"]
[null,null,27,"Jason Robinson","00:38:48","M","V","M V",13,1,{"$nulls":4},"as M SV",{"$nulls":5},"","","",1.125,"","","","",null,"","","","00:43:39","","","","",{"$nulls":7},27,"Jason Robinson","00:38:48","mU60",13,"M","V"]
[null,null,28,"Matt Howells","00:39:39","M","S","M S",12,1,{"$nulls":6},"as FV",{"$nulls":3},"","","","","",1.2656,"","",null,"","","","","","00:50:10.862","","",{"$nulls":7},28,"Matt Howells","00:39:39","mU45",12,"M","S"]
[null,null,29,"Olivia Treharne","00:41:43","F","S","F S",2,1,null,null,2,{"$nulls":7},"",1,"","","","","","",null,"","00:41:43","","","","","","",{"$nulls":7},29,"Olivia Treharne","00:41:43","fU45",2,"F","S"]
[null,null,30,"Peter Harding","00:42:05","M","V","M V",14,1,{"$nulls":6},"as M SV",{"$nulls":3},"","","","","",1.125,"","",null,"","","","","","00:47:20.625","","",{"$nulls":7},30,"Peter Harding","00:42:05","mU60",14,"M","V"]
[null,null,31,"Katherine Buckeridge","00:42:45","F","V","F V",2,1,null,null,2,{"$nulls":7},"",1,"","","","","","",null,"","00:42:45","","","","","","",{"$nulls":7},31,"Katherine Buckeridge","00:42:45","fU60",2,"F","V"]
[null,null,32,"Liz Earley","00:42:54","F","S","F S",3,1,{"$nulls":3},3,{"$nulls":6},"","",1,"","","","","",null,"","","00:42:54","","","","","",{"$nulls":7},32,"Liz Earley","00:42:54","fU45",3,"F","S"]
[null,null,33,"Sarah King","00:42:54.010","F","S","F S",4,1,{"$nulls":4},4,{"$nulls":5},"","","",1,"","","","",null,"","","","00:42:54.010","","","","",{"$nulls":7},33,"Sarah King","00:42:54.010","fU45",3,"F","S"]
[null,null,34,"Josh Franks","00:43:10","M","S","M S",13,1,{"$nulls":7},"as FV",null,null,"","","","","","",1.2656,"",null,"","","","","","","00:54:37.904","",{"$nulls":7},34,"Josh Franks","00:43:10","mU45",13,"M","S"]
[null,null,35,"Lydia Levy","00:43:16","F","S","F S",5,1,{"$nulls":5},5,{"$nulls":4},"","","","",1,"","","",null,"","","","","00:43:16","","","",{"$nulls":7},35,"Lydia Levy","00:43:16","fU45",5,"F","S"]
[null,null,36,"Gemma Morgan","00:43:17","F","S","F S",6,1,{"$nulls":6},6,{"$nulls":3},"","","","","",1,"","",null,"","","","","","00:43:17","","",{"$nulls":7},36,"Gemma Morgan","00:43:17","fU45",6,"F","S"]
[null,null,37,"Mark Sykes","00:43:26","M","SV","M SV",2,1,null,null,2,{"$nulls":7},"",1,"","","","","","",null,"","00:43:26","","","","","","",{"$nulls":7},37,"Mark Sykes","00:43:26","mO60",2,"M","SV"]
[null,null,38,"Shelagh Robinson","00:45:40","F","V","F V",3,1,{"$nulls":3},3,{"$nulls":6},"","",1,"","","","","",null,"","","00:45:40","","","","","",{"$nulls":7},38,"Shelagh Robinson","00:45:40","fU60",3,"F","V"]
[null,null,39,"Amy Lovejoy","00:45:41","F","S","F S",7,1,{"$nulls":7},7,null,null,"","","","","","",1,"",null,"","","","","","","00:45:41","",{"$nulls":7},39,"Amy Lovejoy","00:45:41","fU45",7,"F","S"]
[null,null,40,"Carl Bicknell","00:46:24","M","V","M V",15,1,{"$nulls":7},"as M SV",null,null,"","","","","","",1.125,"",null,"","","","","","","00:52:12","",{"$nulls":7},40,"Carl Bicknell","00:46:24","mU60",15,"M","V"]
[null,null,41,"Jacqueline Barnes","00:46:47","F","V","F V",4,1,{"$nulls":4},4,{"$nulls":5},"","","",1,"","","","",null,"","","","00:46:47","","","","",{"$nulls":7},41,"Jacqueline Barnes","00:46:47","fU60",4,"F","V"]
[null,null,42,"Marion Hemsworth","00:48:20","F","SV","F SV",1,1,null,1,{"$nulls":8},1,"","","","","","","",null,"00:48:20","","","","","","","",{"$nulls":7},42,"Marion Hemsworth","00:48:20","fO60",1,"F","SV"]
[null,null,43,"Linda Tullett","00:50:41","F","V","F V",5,1,{"$nulls":5},5,{"$nulls":4},"","","","",1,"","","",null,"","","","","00:50:41","","","",{"$nulls":7},43,"Linda Tullett","00:50:41","fU60",5,"F","V"]
[null,null,44,"Carys Hind","00:50:55","F","S","F S",8,1,{"$nulls":8},8,null,"","","","","","","",1,null,"","","","","","","","00:50:55",null,null,1.125,{"$nulls":4},44,"Carys Hind","00:50:55","fU45",8,"F","S"]
[null,null,45,{"$nulls":17},"","","","","","","","",null,"","","","","",{"$f":"IFERROR(Z51*$E51,\"\")","v":""},{"$f":"IFERROR(AB51*$E51,\"\")","v":""},{"$nulls":3},{"$f":"AN50^2","v":1.265625}]
[null,null,46,{"$nulls":17},"","","","","","","","",null,"","","","","","","",{"$nulls":3},{"$f":"AN50^3","v":1.423828125}]
[null,null,47,{"$nulls":17},"","","","","","","","",null,"","","","","","",""]
[null,null,48,{"$nulls":17},"","","","","","","","",null,"","","","","","",""]
[null,null,49,{"$nulls":17},"","","","","","","","",null,"","","","","","",""]
[null,null,50,{"$nulls":17},"","","","","","","","",null,"","","","","","",""]
[null,null,51,{"$nulls":17},"","","","","","","","",null,"","","","","","",""]
[null,null,52,{"$nulls":17},"","","","","","","","",null,{"$f":"IFERROR(U58*$E58,\"\")","v":""},"","","",{"$f":"IFERROR(AB58*$E58,\"\")","v":""}]
[null,null,53,{"$nulls":17},"","","","","","","","",null,"","","","",""]
[]
[{"$nulls":8},{"v":0.1,"d":"10%"}]
[{"$nulls":8},{"$f":"TEXT(I61,\"0.0%\")","v":"10.0%"}]
[{"$nulls":4},"average",null,"cat","Count",{"$f":"\"AVG + \"&I62","v":"AVG + 10.0%"},{"$nulls":8},"Additional Cats","Additional Cats"]
[{"$nulls":3},{"$f":"G64&\" \"&$I$63","v":"M S AVG + 10.0%"},{"$f":"SUMIF($H$7:$H$59,G64,$E$7:$E$59)/H64","v":"00:34:50.308"},null,"M S",{"$f":"COUNTIF($H$7:$H$59,G64)","v":13},{"$f":"E64*(1+$I$61)","v":"00:38:19.338"}]
[{"$nulls":3},{"$f":"G65&\" \"&$I$63","v":"M V AVG + 10.0%"},{"$f":"SUMIF($H$7:$H$59,G65,$E$7:$E$59)/H65","v":"00:36:48.868"},null,"M V",{"$f":"COUNTIF($H$7:$H$59,G65)","v":15},{"$f":"E65*(1+$I$61)","v":"00:40:29.755"}]
[{"$nulls":3},"M SV AVG + 10.0%","00:40:48.500",null,"M SV",2,"00:44:53.350",{"$nulls":9},"M SV",{"$nulls":8},1,{"$nulls":8},{"$f":"INDEX($E$64:$I$69,MATCH(S66,$G$64:$G$69,0),5)*AB66","v":"00:44:53.350"}]
[{"$nulls":3},"F S AVG + 10.0%","00:43:36.001",null,"F S",8,"00:47:57.601"]
[{"$nulls":3},"F V AVG + 10.0%","00:44:49.800",null,"F V",5,"00:49:18.780",{"$nulls":9},"F V",{"$nulls":8},1,{"$nulls":8},{"$f":"INDEX($E$64:$I$69,MATCH(S68,$G$64:$G$69,0),5)*AB68","v":"00:49:18.780"}]
[{"$nulls":3},"F SV AVG + 10.0%","00:48:20",null,"F SV",1,"00:53:10",{"$nulls":8},"F SV","F SV",{"$nulls":7},1,1,{"$nulls":7},{"$f":"INDEX($E$64:$I$69,MATCH(R69,$G$64:$G$69,0),5)*AA69","v":"00:53:10"},{"$f":"INDEX($E$64:$I$69,MATCH(S69,$G$64:$G$69,0),5)*AB69","v":"00:53:10"}]
[]
[{"$nulls":7},{"$f":"SUM(H64:H70)","v":44},{"$nulls":3},{"$f":"COUNTA(L7:L59)","v":6},{"$f":"COUNTA(M7:M59)","v":6},6,6,6,6,5,{"$f":"COUNTA(S7:S59)","v":3}]
[{"$nulls":20},"Note"]
[{"$nulls":20},"the fastest runner in a team category is always allocated to their \"natural category\""]

{"sheet":"LewesAC","index":3,"n_rows":59,"n_cols":44,"rows_kept":59,"merged":[[1,25,1,29],[3,10,3,16],[3,18,3,23],[58,18,58,23]]}
[{"$nulls":3},{"$f":"MID(CELL(\"filename\",A1),FIND(\"]\",CELL(\"filename\",A1))+1,255)","v":"LewesAC"}]
[{"$nulls":6},"S","=to V44",{"$nulls":3},1,2,3,4,5,6,{"$nulls":8},"Team Time"]
[{"$nulls":6},"V","= V45-V59"]
[{"$nulls":6},"SV","=V60+",null,null,"Team allocation",{"$nulls":7},"Correction factors",{"$nulls":6},{"$f":"SUM(Z7:Z55)","v":0.1591898148148148},0.17035879629629627,0.17510405555555555,{"$f":"SUM(AC7:AC55)","v":0.18671029629629632},{"$f":"SUM(AD7:AD55)","v":0.18822337962962962},{"$f":"SUM(AE7:AE55)","v":0.20132536168981482}]
[]
[null,null,"posn",null,"time","Gender","Age cat","Gen/Age","rank in cat",null,null,"Team A","Team B","Team C","Team D","Team E","Team F",null,"Team A","Team B","Team C","Team D","Team E","Team F",null,"Team A","Team B","Team C","Team D","Team E","Team F",{"$nulls":9},"Name ","Gen.","Age \ncategory\nS = 16-44\nV = 45-59\nSV = 60+\n(ages on \n13/12/20)","Adjusted time\n(equivalent to DBS time, calculated automatically from last 3 columns) *"]
[null,null,1,{"$f":"AO7","v":"Chris Gilbert"},{"$f":"AR7","v":"00:31:16"},{"$f":"AP7","v":"M"},{"$f":"AQ7","v":"V"},{"$f":"F7&\" \"&G7","v":"M V"},{"$f":"COUNTIFS($H$7:$H$45,H7,$E$7:$E$45,\"<\"&E7)+1","v":1},{"$f":"COUNTA(L7:Q7)","v":1},null,1,{"$nulls":6},{"$f":"IF(ISBLANK(L7)=TRUE(),\"\",IF(ISNUMBER(L7)=TRUE(),1,\"overwrite manually\"))","v":1},{"$f":"IF(ISBLANK(M7)=TRUE(),\"\",IF(ISNUMBER(M7)=TRUE(),1,\"overwrite manually\"))","v":""},"","","",{"$f":"IF(ISBLANK(Q7)=TRUE(),\"\",IF(ISNUMBER(Q7)=TRUE(),1,\"overwrite manually\"))","v":""},null,{"$f":"IFERROR(S7*$E7,\"\")","v":"00:31:16"},{"$f":"IFERROR(T7*$E7,\"\")","v":""},{"$f":"IFERROR(U7*$E7,\"\")","v":""},"","","",{"$nulls":8},1,"Chris Gilbert","M","V","00:31:16"]
[null,null,2,{"$f":"AO8","v":"Mike Ellicock"},{"$f":"AR8","v":"00:31:26"},{"$f":"AP8","v":"M"},{"$f":"AQ8","v":"V"},{"$f":"F8&\" \"&G8","v":"M V"},{"$f":"COUNTIFS($H$7:$H$45,H8,$E$7:$E$45,\"<\"&E8)+1","v":2},{"$f":"COUNTA(L8:Q8)","v":1},null,null,1,{"$nulls":5},{"$f":"IF(ISBLANK(L8)=TRUE(),\"\",IF(ISNUMBER(L8)=TRUE(),1,\"overwrite manually\"))","v":""},1,"","","","",null,{"$f":"IFERROR(S8*$E8,\"\")","v":""},{"$f":"IFERROR(T8*$E8,\"\")","v":"00:31:26"},{"$f":"IFERROR(U8*$E8,\"\")","v":""},{"$f":"IFERROR(V8*$E8,\"\")","v":""},{"$f":"IFERROR(W8*$E8,\"\")","v":""},{"$f":"IFERROR(X8*$E8,\"\")","v":""},{"$nulls":8},2,"Mike Ellicock","M","V","00:31:26"]
[null,null,3,"Lewis Sida","00:31:41","M","V","M V",3,1,{"$nulls":3},1,{"$nulls":4},"","",1,"","","",null,"","","00:31:41","","","",{"$nulls":8},3,"Lewis Sida","M","V","00:31:41"]
[null,null,4,"Mike Green ","00:32:38","M","V","M V",4,1,{"$nulls":4},1,{"$nulls":3},"","","",1,"","",null,"","","","00:32:38","","",{"$nulls":8},4,"Mike Green ","M","V","00:32:38"]
[null,null,5,"Ben Pepler","00:32:49","M","S","M S",1,1,null,1,{"$nulls":6},1,"","","","","",null,"00:32:49","","","","","",{"$nulls":8},5,"Ben Pepler","M","S","00:32:49"]
[null,null,6,"Ben Hodgson","00:33:57","M","V","M V",5,1,{"$nulls":5},1,null,null,{"$f":"IF(ISBLANK(L12)=TRUE(),\"\",IF(ISNUMBER(L12)=TRUE(),1,\"overwrite manually\"))","v":""},"","","",1,"",null,"","","","","00:33:57","",{"$nulls":8},6,"Ben Hodgson","M","V","00:33:57"]
[null,null,7,"Rick Curtis","00:34:00","M","V","M V",6,1,{"$nulls":6},1,null,"","","","","",1,null,"","","","","","00:34:00",{"$nulls":8},7,"Rick Curtis","M","V","00:34:00"]
[null,null,8,"Robert Cooper","00:35:41","M","V","M V",7,1,null,null,"as M S",{"$nulls":5},{"$f":"IF(ISBLANK(L14)=TRUE(),\"\",IF(ISNUMBER(L14)=TRUE(),1,\"overwrite manually\"))","v":""},1,{"$f":"IF(ISBLANK(N14)=TRUE(),\"\",IF(ISNUMBER(N14)=TRUE(),1,\"overwrite manually\"))","v":""},{"$f":"IF(ISBLANK(O14)=TRUE(),\"\",IF(ISNUMBER(O14)=TRUE(),1,\"overwrite manually\"))","v":""},"",{"$f":"IF(ISBLANK(Q14)=TRUE(),\"\",IF(ISNUMBER(Q14)=TRUE(),1,\"overwrite manually\"))","v":""},null,"","00:35:41","","","","",{"$nulls":8},8,"Robert Cooper","M","V","00:35:41"]
[null,null,9,"Helen Sida","00:37:39","F","V","F V",1,1,null,1,{"$nulls":6},1,{"$f":"IF(ISBLANK(M15)=TRUE(),\"\",IF(ISNUMBER(M15)=TRUE(),1,\"overwrite manually\"))","v":""},"","","","",null,"00:37:39","","","","","",{"$nulls":8},9,"Helen Sida","F","V","00:37:39"]
[null,null,10,"Michael Ussher","00:37:39","M","V","M V",8,1,{"$nulls":3},"as F SV",{"$nulls":4},"","",1.2656,"","","",null,"","","00:47:38.990","","","",{"$nulls":8},10,"Michael Ussher","M","V","00:37:39"]
[null,null,11,"Mauro Lazzati","00:38:26","M","V","M V",9,1,{"$nulls":3},"as M S",{"$nulls":4},"","",1,"","","",null,"","","00:38:26","","","",{"$nulls":8},11,"Mauro Lazzati","M","V","00:38:26"]
[null,null,12,"David Prince-Iles","00:38:27","M","SV","M SV",1,1,null,1,{"$nulls":6},1,"","","","","",null,"00:38:27","","","","","",{"$nulls":8},12,"David Prince-Iles","M","SV","00:38:27"]
[null,null,13,"Rob Stanway","00:39:01","M","V","M V",10,1,{"$nulls":4},"as F SV",{"$nulls":3},"","","",1.2656,"","",null,"","","","00:49:22.770","","",{"$nulls":8},13,"Rob Stanway","M","V","00:39:01"]
[null,null,14,"Mat Homewood","00:39:37","M","V","M V",11,1,{"$nulls":4},"as M S",{"$nulls":3},"","","",1,"","",null,"","","","00:39:37","","",{"$nulls":8},14,"Mat Homewood","M","V","00:39:37"]
[null,null,15,"David Foster","00:39:39","M","V","M V",12,1,{"$nulls":5},"as F S",null,null,"","","","",1,"",null,"","","","","00:39:39","",{"$nulls":8},15,"David Foster","M","V","00:39:39"]
[null,null,16,"Ellen Brookes","00:39:39","F","S","F S",1,1,null,1,{"$nulls":6},1,"","","","","",null,"00:39:39","","","","","",{"$nulls":8},16,"Ellen Brookes","F","S","00:39:39"]
[null,null,17,"Tamsyn d'Arienzo","00:39:45","F","S","F S",2,1,null,null,1,{"$nulls":5},"",1,"","","","",null,"","00:39:45","","","","",{"$nulls":8},17,"Tamsyn d'Arienzo","F","S","00:39:45"]
[null,null,18,"Gerard Dummett ","00:42:37","M","SV","M SV",2,1,null,null,1,{"$nulls":5},"",1,"","","","",null,"","00:42:37","","","","",{"$nulls":8},18,"Gerard Dummett ","M","SV","00:42:37"]
[null,null,19,"Peter Kennedy","00:43:32","M","SV","M SV",3,1,{"$nulls":3},1,{"$nulls":4},"","",1,"","","",null,"","","00:43:32","","","",{"$nulls":8},19,"Peter Kennedy","M","SV","00:43:32"]
[null,null,20,"Beth Hancock","00:43:48","F","S","F S",3,1,{"$nulls":3},1,{"$nulls":4},"","",1,"","","",null,"","","00:43:48","","","",{"$nulls":8},20,"Beth Hancock","F","S","00:43:48"]
[null,null,21,"Ian Hilder","00:44:13","M","SV","M SV",4,1,{"$nulls":4},1,{"$nulls":3},"","","",1,"","",null,"","","","00:44:13","","",{"$nulls":8},21,"Ian Hilder","M","SV","00:44:13"]
[null,null,22,"Andy Perris","00:44:19","M","V","M V",13,1,{"$nulls":5},"as M S",null,null,"","","","",1,"",null,"","","","","00:44:19","",{"$nulls":8},22,"Andy Perris","M","V","00:44:19"]
[null,null,23,"Helen Bowman","00:45:37","F","V","F V",2,1,null,null,1,{"$nulls":5},"",1,"","","","",null,"","00:45:37","","","","",{"$nulls":8},23,"Helen Bowman","F","V","00:45:37"]
[null,null,24,"Mark Pappenheim","00:46:30","M","SV","M SV",5,1,{"$nulls":5},1,null,null,"","","","",1,"",null,"","","","","00:46:30","",{"$nulls":8},24,"Mark Pappenheim","M","SV","00:46:30"]
[null,null,25,"Bob Hughes","00:46:45","M","SV","M SV",6,1,{"$nulls":6},1,null,"","","","","",1,null,"","","","","","00:46:45",{"$nulls":8},25,"Bob Hughes","M","SV","00:46:45"]
[null,null,26,"Ruth Wray","00:47:03","F","V","F V",3,1,{"$nulls":3},1,{"$nulls":4},"","",1,"","","",null,"","","00:47:03","","","",{"$nulls":8},26,"Ruth Wray","F","V","00:47:03"]
[null,null,27,"Hugh St John","00:47:16","M","SV","M SV",7,1,{"$nulls":5},"as F SV",null,null,"","","","",1.125,"",null,"","","","","00:53:10.500","",{"$nulls":8},27,"Hugh St John","M","SV","00:47:16"]
[null,null,28,"Andrew Chitty","00:47:16.010","M","SV","M SV",8,1,{"$nulls":6},"as F SV",null,"","","","","",1.125,null,"","","","","","00:53:10.511",{"$nulls":8},28,"Andrew Chitty","M","SV","00:47:16.010"]
[null,null,29,"Colin Hartland","00:47:43","M","SV","M SV",9,1,{"$nulls":6},"as M S",null,"","","","","",1,null,"","","","","","00:47:43",{"$nulls":8},29,"Colin Hartland","M","SV","00:47:43"]
[null,null,30,"Fran Witt","00:48:51","F","V","F V",4,1,{"$nulls":4},1,{"$nulls":3},"","","",1,"","",null,"","","","00:48:51","","",{"$nulls":8},30,"Fran Witt","F","V","00:48:51"]
[null,null,31,"Anne Hagan","00:49:24","F","SV","F SV",1,1,null,1,{"$nulls":6},1,"","","","","",null,"00:49:24","","","","","",{"$nulls":8},31,"Anne Hagan","F","SV","00:49:24"]
[null,null,32,"Anita Amies","00:50:13","F","SV","F SV",2,1,null,null,1,{"$nulls":5},"",1,"","","","",null,"","00:50:13","","","","",{"$nulls":8},32,"Anita Amies","F","SV","00:50:13"]
[null,null,33,"Emma Hodgson","00:53:27","F","V","F V",5,1,{"$nulls":5},1,null,null,{"$f":"IF(ISBLANK(L39)=TRUE(),\"\",IF(ISNUMBER(L39)=TRUE(),1,\"overwrite manually\"))","v":""},"","","",1,"",null,"","","","","00:53:27","",{"$nulls":8},33,"Emma Hodgson","F","V","00:53:27"]
[null,null,34,"Emma Gardner","00:54:04","F","V","F V",6,1,{"$nulls":6},1,null,"","","","","",1,null,"","","","","","00:54:04",{"$nulls":8},34,"Emma Gardner","F","V","00:54:04"]
[null,null,35,"Naomi Ross","00:54:10","F","S","F S",4,1,{"$nulls":4},1,{"$nulls":3},"","","",1,"","",null,"","","","00:54:10","","",{"$nulls":8},35,"Naomi Ross","F","S","00:54:10"]
[null,null,36,"Julie Deakin ","00:54:12","F","V","F V",7,1,{"$nulls":6},"as F S",null,{"$f":"IF(ISBLANK(L42)=TRUE(),\"\",IF(ISNUMBER(L42)=TRUE(),1,\"overwrite manually\"))","v":""},{"$f":"IF(ISBLANK(M42)=TRUE(),\"\",IF(ISNUMBER(M42)=TRUE(),1,\"overwrite manually\"))","v":""},{"$f":"IF(ISBLANK(N42)=TRUE(),\"\",IF(ISNUMBER(N42)=TRUE(),1,\"overwrite manually\"))","v":""},{"$f":"IF(ISBLANK(O42)=TRUE(),\"\",IF(ISNUMBER(O42)=TRUE(),1,\"overwrite manually\"))","v":""},{"$f":"IF(ISBLANK(P42)=TRUE(),\"\",IF(ISNUMBER(P42)=TRUE(),1,\"overwrite manually\"))","v":""},1,null,"","","","","","00:54:12",{"$nulls":8},36,"Julie Deakin ","F","V","00:54:12"]
[null,null,37,{"$nulls":15},"","","","","",{"$f":"IF(ISBLANK(Q43)=TRUE(),\"\",IF(ISNUMBER(Q43)=TRUE(),1,\"overwrite manually\"))","v":""},null,{"$f":"IFERROR(S43*$E43,\"\")","v":""},"","","",{"$f":"IFERROR(X43*$E43,\"\")","v":""}]
[null,null,38,{"$nulls":15},"","","","","","",null,"","","","",""]
[null,null,39,{"$nulls":15},"","","","","","",null,"","","","",""]
[]
[{"$nulls":8},{"$f":"HHH!I61","v":{"v":0.1,"d":"10%"}},null,"check",{"$f":"COUNTA(L7:L45)","v":6},{"$f":"COUNTA(M7:M45)","v":6},6,6,6,6]
[{"$nulls":8},{"$f":"TEXT(I47,\"0.0%\")","v":"10.0%"}]
[{"$nulls":4},"average",null,"cat","Count",{"$f":"\"AVG + \"&I48","v":"AVG + 10.0%"}]
[{"$nulls":4},{"$f":"SUMIF($H$7:$H$45,G50,$E$7:$E$45)/H50","v":"00:32:49"},null,"M S",{"$f":"COUNTIF($H$7:$H$45,G50)","v":1},{"$f":"E50*(1+$I$47)","v":"00:36:05.900"}]
[{"$nulls":4},{"$f":"SUMIF($H$7:$H$45,G51,$E$7:$E$45)/H51","v":"00:36:06.154"},null,"M V",{"$f":"COUNTIF($H$7:$H$45,G51)","v":13},{"$f":"E51*(1+$I$47)","v":"00:39:42.769"}]
[{"$nulls":4},"00:44:55.446",null,"M SV",9,"00:49:24.990"]
[{"$nulls":4},"00:44:20.500",null,"F S",4,"00:48:46.550"]
[{"$nulls":4},"00:48:41.857",null,"F V",7,"00:53:34.043"]
[{"$nulls":4},"00:49:48.500",null,"F SV",2,"00:54:47.350"]
[]
[{"$nulls":7},{"$f":"SUM(H50:H56)","v":36}]
[{"$nulls":18},"Note"]
[{"$nulls":18},"the fastest runner in a team category is always allocated to their \"natural category\""]

{"sheet":"Phoenix","index":4,"n_rows":81,"n_cols":61,"rows_kept":81,"merged":[[1,31,1,35],[3,10,3,19],[3,21,3,29],[70,21,70,29]]}
[{"$nulls":3},{"$f":"MID(CELL(\"filename\",A1),FIND(\"]\",CELL(\"filename\",A1))+1,255)","v":"Phoenix"}]
[{"$nulls":6},"S","=to V44",{"$nulls":3},1,2,3,4,5,6,7,8,9,{"$nulls":11},"Team Time"]
[{"$nulls":6},"V","= V45-V59"]
[{"$nulls":6},"SV","=V60+",null,null,"Team allocation",{"$nulls":10},"Correction factors",{"$nulls":9},{"$f":"SUM(AF7:AF67)","v":0.15130787037037038},{"$f":"SUM(AG7:AG67)","v":0.15675716666666667},0.16371533333333332,0.1706122037037037,0.1759850925925926,0.178783668595679,0.19443831944444445,0.21011747685185186,{"$f":"SUM(AN7:AN67)","v":0.18311554819315845}]
[]
[null,null,"posn",null,"time","Gender","Age cat","Gen/Age","rank in cat",null,null,"Team A","Team B","Team C","Team D","Team E","Team F","Team G","Team H","Team I",null,"Team A","Team B","Team C","Team D","Team E","Team F","Team G","Team H","Team I",null,"Team A","Team B","Team C","Team D","Team E","Team F","Team G","Team H","Team I",{"$nulls":5},"Name  ","Age Category ","Time","Time 2","Gender","Cat",null,null,"RUNNER","CATEGORY","TIME","LDRBOARD","time 2"]
[null,null,1,{"$f":"AT7","v":"Simon Heath "},{"$f":"AW7","v":"00:29:37"},{"$f":"AX7","v":"M"},{"$f":"AY7","v":"S"},{"$f":"F7&\" \"&G7","v":"M S"},{"$f":"COUNTIFS($H$7:$H$57,H7,$E$7:$E$57,\"<\"&E7)+1","v":1},{"$f":"COUNTA(L7:U7)","v":1},null,1,{"$nulls":9},{"$f":"IF(ISBLANK(L7)=TRUE(),\"\",IF(ISNUMBER(L7)=TRUE(),1,\"overwrite manually\"))","v":1},{"$f":"IF(ISBLANK(M7)=TRUE(),\"\",IF(ISNUMBER(M7)=TRUE(),1,\"overwrite manually\"))","v":""},{"$f":"IF(ISBLANK(N7)=TRUE(),\"\",IF(ISNUMBER(N7)=TRUE(),1,\"overwrite manually\"))","v":""},{"$f":"IF(ISBLANK(O7)=TRUE(),\"\",IF(ISNUMBER(O7)=TRUE(),1,\"overwrite manually\"))","v":""},{"$f":"IF(ISBLANK(P7)=TRUE(),\"\",IF(ISNUMBER(P7)=TRUE(),1,\"overwrite manually\"))","v":""},{"$f":"IF(ISBLANK(Q7)=TRUE(),\"\",IF(ISNUMBER(Q7)=TRUE(),1,\"overwrite manually\"))","v":""},"","","",null,{"$f":"IFERROR(V7*$E7,\"\")","v":"00:29:37"},{"$f":"IFERROR(W7*$E7,\"\")","v":""},"","","","","","","",{"$nulls":5},"Simon Heath ","M16-44 ",1.2340277777777777,{"$f":"AV7/60","v":0.02056712962962963},"M","S",null,null,"Simon Heath","M16-44","29:37","L",{"$f":"BD7/60","v":0.02056712962962963},null,{"$f":"BF7=AW7","v":true}]
[null,null,2,"Todd Leckie ","00:30:17","M","S",{"$f":"F8&\" \"&G8","v":"M S"},{"$f":"COUNTIFS($H$7:$H$57,H8,$E$7:$E$57,\"<\"&E8)+1","v":2},{"$f":"COUNTA(L8:U8)","v":1},null,null,2,{"$nulls":8},{"$f":"IF(ISBLANK(L8)=TRUE(),\"\",IF(ISNUMBER(L8)=TRUE(),1,\"overwrite manually\"))","v":""},{"$f":"IF(ISBLANK(M8)=TRUE(),\"\",IF(ISNUMBER(M8)=TRUE(),1,\"overwrite manually\"))","v":1},{"$f":"IF(ISBLANK(N8)=TRUE(),\"\",IF(ISNUMBER(N8)=TRUE(),1,\"overwrite manually\"))","v":""},{"$f":"IF(ISBLANK(O8)=TRUE(),\"\",IF(ISNUMBER(O8)=TRUE(),1,\"overwrite manually\"))","v":""},{"$f":"IF(ISBLANK(P8)=TRUE(),\"\",IF(ISNUMBER(P8)=TRUE(),1,\"overwrite manually\"))","v":""},{"$f":"IF(ISBLANK(Q8)=TRUE(),\"\",IF(ISNUMBER(Q8)=TRUE(),1,\"overwrite manually\"))","v":""},{"$f":"IF(ISBLANK(R8)=TRUE(),\"\",IF(ISNUMBER(R8)=TRUE(),1,\"overwrite manually\"))","v":""},{"$f":"IF(ISBLANK(S8)=TRUE(),\"\",IF(ISNUMBER(S8)=TRUE(),1,\"overwrite manually\"))","v":""},{"$f":"IF(ISBLANK(T8)=TRUE(),\"\",IF(ISNUMBER(T8)=TRUE(),1,\"overwrite manually\"))","v":""},null,{"$f":"IFERROR(V8*$E8,\"\")","v":""},{"$f":"IFERROR(W8*$E8,\"\")","v":"00:30:17"},{"$f":"IFERROR(X8*$E8,\"\")","v":""},{"$f":"IFERROR(Y8*$E8,\"\")","v":""},{"$f":"IFERROR(Z8*$E8,\"\")","v":""},{"$f":"IFERROR(AA8*$E8,\"\")","v":""},{"$f":"IFERROR(AB8*$E8,\"\")","v":""},{"$f":"IFERROR(AC8*$E8,\"\")","v":""},{"$f":"IFERROR(AD8*$E8,\"\")","v":""},{"$nulls":5},"Todd Leckie ","M16-44 ",1.2618055555555556,0.021030092592592593,"M","S",null,null,"Todd Leckie","M16-44","30:17","L",0.021030092592592593,null,{"$f":"BF8=AW8","v":true}]
[null,null,3,"Jon Clays ","00:30:21","M","S",{"$f":"F9&\" \"&G9","v":"M S"},{"$f":"COUNTIFS($H$7:$H$57,H9,$E$7:$E$57,\"<\"&E9)+1","v":3},1,{"$nulls":3},3,{"$nulls":7},"","",1,"","","","","","",null,"","","00:30:21","","","","","","",{"$nulls":5},"Jon Clays ","M16-44 ",1.2645833333333334,0.02107638888888889,"M","S",null,null,"Jon Clays","M16-44","30:21","L",0.02107638888888889,null,true]
[null,null,4,"Jim Lathbury ","00:30:24","M","S","M S",4,1,{"$nulls":4},4,{"$nulls":6},"","","",1,"","","","","",null,"","","","00:30:24","","","","","",{"$nulls":5},"Jim Lathbury ","M16-44 ",1.2666666666666666,0.021111111111111112,"M","S",null,null," Jim Lathbury","M16-44","30:24","L",0.021111111111111112,null,true]
[null,null,5,"Alex Garrod ","00:31:05","M","S","M S",5,1,{"$nulls":5},5,{"$nulls":5},"","","","",1,"","","","",null,"","","","","00:31:05","","","","",{"$nulls":5},"Alex Garrod ","M16-44 ",1.2951388888888888,0.02158564814814815,"M","S",null,null,"Alex Garrod","M16-44","31:05","L",0.02158564814814815,null,true]
[null,null,6,"Stuart Roberts ","00:32:21","M","V","M V",1,1,null,1,{"$nulls":9},1,"","","","","","","","",null,"00:32:21","","","","","","","","",{"$nulls":5},"Stuart Roberts ","M45-59 ",1.3479166666666667,0.02246527777777778,"M","V",null,null,"Stuart Roberts","M45-59","32:21","L",0.02246527777777778,null,true]
[null,null,7,"Paul Weir ","00:32:36","M","S","M S",6,1,{"$nulls":6},6,{"$nulls":4},"","","","","",1,"","","",null,"","","","","","00:32:36","","","",{"$nulls":5},"Paul Weir ","M16-44 ",1.3583333333333334,0.02263888888888889,"M","S",null,null,"Paul Weir","M16-44","32:36","L",0.02263888888888889,null,true]
[null,null,8,"Tom Clewley ","00:33:00","M","S","M S",7,1,{"$nulls":7},7,{"$nulls":3},"","","","","","",1,"","",null,"","","","","","","00:33:00","","",{"$nulls":5},"Tom Clewley ","M16-44 ",1.375,0.022916666666666665,"M","S",null,null,"Tom Clewley","M16-44","33:00","L",0.022916666666666665,null,true]
[null,null,9,"Matt Greenall ","00:33:47","M","V","M V",2,1,null,null,2,{"$nulls":8},"",1,"","","","","","","",null,"","00:33:47","","","","","","","",{"$nulls":5},"Matt Greenall ","M45-59 ",1.4076388888888889,0.023460648148148147,"M","V",null,null,"Matt Greenall","M45-59","33:47","L",0.023460648148148147,null,true]
[null,null,10,"Tony Rickwood ","00:33:55","M","V","M V",3,1,{"$nulls":3},3,{"$nulls":7},"","",1,"","","","","","",null,"","","00:33:55","","","","","","",{"$nulls":5},"Tony Rickwood ","M45-59 ",1.4131944444444444,0.02355324074074074,"M","V",null,null,"Tony Rickwood","M45-59","33:55","L",0.02355324074074074,null,true]
[null,null,11,"Dermot Cameron ","00:34:19","M","S","M S",8,1,{"$nulls":8},8,null,null,"","","","","","","",1,"",null,"","","","","","","","00:34:19","",{"$nulls":5},"Dermot Cameron ","M16-44 ",1.4298611111111112,0.023831018518518522,"M","S",null,null,"Dermot Cameron","M16-44","34:19","L",0.023831018518518522,null,true]
[null,null,12,"Sébastien Béhuret ","00:34:22","M","S","M S",9,1,{"$nulls":9},9,null,"","","","","","","","",1,null,"","","","","","","","","00:34:22",{"$nulls":5},"Sébastien Béhuret ","M16-44 ",1.4319444444444445,0.02386574074074074,"M","S",null,null,"Sébastien Béhuret","M16-44","34:22","L",0.02386574074074074,null,true]
[null,null,13,"Bobby Searle ","00:34:23","F","S","F S",1,1,null,1,{"$nulls":9},1,"","","","","","","","",null,"00:34:23","","","","","","","","",{"$nulls":5},"Bobby Searle ","F16-44 ",1.4326388888888888,0.023877314814814813,"F","S",null,null,"Bobby Searle","F16-44","34:23","L",0.023877314814814813,null,true]
[null,null,14,"Paul Lawrence ","00:34:30","M","V","M V",4,1,{"$nulls":4},4,{"$nulls":6},"","","",1,"","","","","",null,"","","","00:34:30","","","","","",{"$nulls":5},"Paul Lawrence ","M45-59 ",1.4375,0.023958333333333335,"M","V",null,null,"Paul Lawrence","M45-59","34:30","L",0.023958333333333335,null,true]
[null,null,15,"Geoff Pike ","00:34:35","M","V","M V",5,1,{"$nulls":5},5,{"$nulls":5},"","","","",1,"","","","",null,"","","","","00:34:35","","","","",{"$nulls":5},"Geoff Pike ","M45-59 ",1.4409722222222223,0.024016203703703706,"M","V",null,null,"Geoff Pike","M45-59","34:35","L",0.024016203703703706,null,true]
[null,null,16,"Donald Maclellan ","00:34:40","M","V","M V",6,1,{"$nulls":6},6,{"$nulls":4},"","","","","",1,"","","",null,"","","","","","00:34:40","","","",{"$nulls":5},"Donald Maclellan ","M45-59 ",1.4444444444444444,0.024074074074074074,"M","V",null,null,"Donald Maclellan","M45-59","34:40","L",0.024074074074074074,null,true]
[null,null,17,"Paul Whelpton ","00:34:40","M","SV","M SV",1,1,null,1,{"$nulls":9},1,"","","","","","","","",null,"00:34:40","","","","","","","","",{"$nulls":5},"Paul Whelpton ","M60 ",1.4444444444444444,0.024074074074074074,"M","SV",null,null,"Paul Whelpton","M60","34:40","L",0.024074074074074074,null,true]
[null,null,18,"Jim Whitelegg ","00:34:59","M","V","M V",7,1,{"$nulls":7},7,{"$nulls":3},"","","","","","",1,"","",null,"","","","","","","00:34:59","","",{"$nulls":5},"Jim Whitelegg ","M45-59 ",1.457638888888889,0.024293981481481482,"M","V",null,null,"Jim Whitelegg","M45-59","34:59","ADJUSTED",0.024293981481481482,null,true]
[null,null,19,"Tom Sanderson ","00:35:47","M","V","M V",8,1,{"$nulls":8},8,null,null,"","","","","","","",1,"",null,"","","","","","","","00:35:47","",{"$nulls":5},"Tom Sanderson ","M45-59 ",1.4909722222222221,0.024849537037037035,"M","V",null,null,"Tom Sanderson","M45-59","35:47","L",0.024849537037037035,null,true]
[null,null,20,"Erica Martin ","00:36:06","F","S","F S",2,1,null,null,2,{"$nulls":8},"",1,"","","","","","","",null,"","00:36:06","","","","","","","",{"$nulls":5},"Erica Martin ","F16-44 ",1.5041666666666667,0.025069444444444443,"F","S",null,null,"Erica Martin","F16-44","36:06","L",0.025069444444444443,null,true]
[null,null,21,"Barry Blackwell ","00:36:40","M","V","M V",9,1,{"$nulls":9},9,null,"","","","","","","","",1,null,"","","","","","","","","00:36:40",{"$nulls":5},"Barry Blackwell ","M45-59 ",1.5277777777777777,0.02546296296296296,"M","V",null,null,"Barry Blackwell","M45-59","36:40","ADJUSTED",0.02546296296296296,null,true]
[null,null,22,"Samantha Leader ","00:37:03","F","V","F V",1,1,null,1,{"$nulls":9},1,"","","","","","","","",null,"00:37:03","","","","","","","","",{"$nulls":5},"Samantha Leader ","F45-59 ",1.54375,0.025729166666666668,"F","V",null,null,"Samantha Leader","F45-59","37:03","L",0.025729166666666668,null,true]
[null,null,23,"Andy Bone ","00:37:12","M","V","M V",10,1,null,null,"as FSV",{"$nulls":8},"",1.2656,"","","","","","","",null,"","00:47:04.819","","","","","","","",{"$nulls":5},"Andy Bone ","M45-59 ",1.55,0.025833333333333333,"M","V",null,null,"Andy Bone","M45-59","37:12","L",0.025833333333333333,null,true]
[null,null,24,"Cat Bounds ","00:37:22","F","S","F S",3,1,{"$nulls":3},3,{"$nulls":7},"","",1,"","","","","","",null,"","","00:37:22","","","","","","",{"$nulls":5},"Cat Bounds ","F16-44 ",1.5569444444444445,0.025949074074074076,"F","S",null,null,"Cat Bounds","F16-44","37:22","L",0.025949074074074076,null,true]
[null,null,25,"Andrew Haslam ","00:37:50","M","S","M S",10,1,{"$nulls":7},"as M SV",{"$nulls":3},"","","","","","",1.2656,"","",null,"","","","","","","00:47:52.912","","",{"$nulls":5},"Andrew Haslam ","M16-44 ",1.576388888888889,0.02627314814814815,"M","S","tbc",null,"Andrew Haslam","M16-44","37:50","ESTIMATE",0.02627314814814815,null,true]
[null,null,26,"Sibel Recber ","00:38:22","F","S","F S",4,1,{"$nulls":4},4,{"$nulls":6},"","","",1,"","","","","",null,"","","","00:38:22","","","","","",{"$nulls":5},"Sibel Recber ","F16-44 ",1.5986111111111112,0.02664351851851852,"F","S",null,null,"Sibel Latchman","F16-44","38:22","L",0.02664351851851852,null,true]
[null,null,27,"Andy Pumphrey ","00:38:28","M","V","M V",11,1,{"$nulls":3},"as F SV",{"$nulls":7},"","",1.2656,"","","","","","",null,"","","00:48:41.005","","","","","","",{"$nulls":5},"Andy Pumphrey ","M45-59 ",1.6027777777777779,0.026712962962962963,"M","V",null,null,"Andy Pumphrey","M45-59","38:28","ESTIMATE",0.026712962962962963,null,true]
[null,null,28,"Sara Burns ","00:38:29","F","V","F V",2,1,null,null,2,{"$nulls":8},"",1,"","","","","","","",null,"","00:38:29","","","","","","","",{"$nulls":5},"Sara Burns ","F45-59 ",1.6034722222222222,0.026724537037037036,"F","V",null,null,"Sara Burns","F45-59","38:29","L",0.026724537037037036,null,true]
[null,null,29,"Emily Budd ","00:38:37","F","S","F S",5,1,{"$nulls":5},5,{"$nulls":5},"","","","",1,"","","","",null,"","","","","00:38:37","","","","",{"$nulls":5},"Emily Budd ","F16-44 ",1.6090277777777777,0.026817129629629628,"F","S",null,null,"Emily Budd","F16-44","38:37","L",0.026817129629629628,null,true]
[null,null,30,"Andrew Brooks ","00:39:09","M","V","M V",12,1,{"$nulls":4},"as F SV",{"$nulls":6},"","","",1.2656,"","","","","",null,"","","","00:49:32.894","","","","","",{"$nulls":5},"Andrew Brooks ","M45-59 ",1.6312499999999999,0.027187499999999996,"M","V",null,null,"Andrew Brooks","M45-59","39:09","ADJUSTED",0.027187499999999996,null,true]
[null,null,31,"Chelsey Hallam ","00:39:36","F","S","F S",6,1,{"$nulls":6},6,{"$nulls":4},"","","","","",1,"","","",null,"","","","","","00:39:36","","","",{"$nulls":5},"Chelsey Hallam ","F16-44 ",1.6500000000000001,0.027500000000000004,"F","S",null,null,"Chelsey Hallam","F16-44","39:36","L",0.027500000000000004,null,true]
[null,null,32,"Mike Townley ","00:39:55","M","V","M V",13,1,{"$nulls":5},"as FSV",{"$nulls":5},"","","","",1.2656,"","","","",null,"","","","","00:50:31.112","","","","",{"$nulls":5},"Mike Townley ","M45-59 ",1.6631944444444444,0.02771990740740741,"M","V",null,null,"Mike Townley","M45-59","39:55","L",0.02771990740740741,null,true]
[null,null,33,{"$f":"AT39","v":"Geoff Manns "},{"$f":"AW39","v":"00:39:58"},{"$f":"AX39","v":"M"},{"$f":"AY39","v":"V"},"M V",14,1,{"$nulls":6},"as FSV",{"$nulls":4},"","","","","",1.2656,"","","",null,"","","","","","00:50:34.909","","","",{"$nulls":5},"Geoff Manns ","M45-59 ",1.6652777777777779,{"$f":"AV39/60","v":0.027754629629629633},"M","V",null,null,"Geoff Manns","M45-59","39:58","L",{"$f":"BD39/60","v":0.027754629629629633},null,true]
[null,null,34,"Georgie Anderson ","00:39:59","F","S","F S",7,1,{"$nulls":7},7,{"$nulls":3},"","","","","","",1,"","",null,"","","","","","","00:39:59","","",{"$nulls":5},"Georgie Anderson ","F16-44 ",1.6659722222222222,0.027766203703703703,"F","S",null,null,"Georgie Anderson","F16-44","39:59","L",0.027766203703703703,null,true]
[null,null,35,"Dan Allen ","00:40:00","M","SV","M SV",2,1,null,null,2,{"$nulls":8},"",1,"","","","","","","",null,"","00:40:00","","","","","","","",{"$nulls":5},"Dan Allen ","M60 ",1.6666666666666667,0.02777777777777778,"M","SV",null,null,"Dan Allen","M60","40:00","L",0.02777777777777778,null,true]
[null,null,36,"Jess Stribbling ","00:40:05","F","S","F S",8,1,{"$nulls":8},8,null,null,"","","","","","","",1,"",null,"","","","","","","","00:40:05","",{"$nulls":5},"Jess Stribbling ","F16-44 ",1.670138888888889,0.02783564814814815,"F","S",null,null,"Jess Stribbling","F16-44","40:05","L",0.02783564814814815,null,true]
[null,null,37,"Amelia Culshaw ","00:41:10","F","V","F V",3,1,{"$nulls":3},3,{"$nulls":7},"","",1,"","","","","","",null,"","","00:41:10","","","","","","",{"$nulls":5},"Amelia Culshaw ","F45-59 ",1.7152777777777777,0.02858796296296296,"F","V",null,null,"Amelia Culshaw","F45-59","41:10","ADJUSTED",0.02858796296296296,null,true]
[null,null,38,"Rachel Gorman ","00:41:13","F","S","F S",9,1,{"$nulls":9},9,null,"","","","","","","","",1,null,"","","","","","","","","00:41:13",{"$nulls":5},"Rachel Gorman ","F16-44 ",1.7173611111111111,0.028622685185185185,"F","S",null,null,"Rachel Gorman","F16-44","41:13","ADJUSTED",0.028622685185185185,null,true]
[null,null,39,"Liz Halliday ","00:42:56","F","V","F V",4,1,{"$nulls":4},4,{"$nulls":6},"","","",1,"","","","","",null,"","","","00:42:56","","","","","",{"$nulls":5},"Liz Halliday ","F45-59 ",1.7888888888888888,0.02981481481481481,"F","V",null,null,"Liz Halliday","F45-59","42:56","L",0.02981481481481481,null,true]
[null,null,40,"Val Avella ","00:44:08","F","S","F S",10,1,{"$nulls":7},"as F SV",{"$nulls":3},"","","","","","",1.2656,"","",null,"","","","","","","00:55:51.309","","",{"$nulls":5},"Val Avella ","F16-44 ",1.8388888888888888,0.030648148148148147,"F","S",null,null,"Val Avella","F16-44","44:08","ADJUSTED",0.030648148148148147,null,true]
[null,null,41,"Andrew Haig ","00:44:16","M","SV","M SV",3,1,{"$nulls":3},3,{"$nulls":7},"","",1,"","","","","","",null,"","","00:44:16","","","","","","",{"$nulls":5},"Andrew Haig ","M60 ",1.8444444444444443,0.03074074074074074,"M","SV",null,null,"Andrew Haig","M60","44:16","ESTIMATE",0.03074074074074074,null,true]
[null,null,42,"Lisa Ebdon ","00:47:31","F","V","F V",5,1,{"$nulls":5},5,{"$nulls":5},"","","","",1,"","","","",null,"","","","","00:47:31","","","","",{"$nulls":5},"Lisa Ebdon ","F45-59 ",1.979861111111111,0.032997685185185185,"F","V",null,null,"Lisa Ebdon","F45-59","47:31","ADJUSTED",0.032997685185185185,null,true]
[null,null,43,"Sarah Russell ","00:48:54","F","V","F V",6,1,{"$nulls":6},6,{"$nulls":4},"","","","","",1,"","","",null,"","","","","","00:48:54","","","",{"$nulls":5},"Sarah Russell ","F45-59 ",2.0375,0.03395833333333333,"F","V",null,null,"Sarah Russell","F45-59","48:54","L",0.03395833333333333,null,true]
[null,null,44,"Jude Matthews ","00:49:49","F","SV","F SV",1,1,null,1,{"$nulls":9},1,"","","","","","","","",null,"00:49:49","","","","","","","","",{"$nulls":5},"Jude Matthews ","F60 ",2.0756944444444447,0.034594907407407414,"F","SV",null,null,"Jude Matthews","F60","49:49","L",0.034594907407407414,null,true]
[null,null,45,"Eogan McKenna ","00:49:56","M","SV","M SV",4,1,{"$nulls":4},4,{"$nulls":6},"","","",1,"","","","","",null,"","","","00:49:56","","","","","",{"$nulls":5},"Eogan McKenna ","M60 ",2.0805555555555553,0.03467592592592592,"M","SV",null,null,"Eogan McKenna","M60","49:56","L",0.03467592592592592,null,true]
[null,null,46,"Rik Taub ","00:51:06","M","SV","M SV",5,1,{"$nulls":5},5,{"$nulls":5},"","","","",1,"","","","",null,"","","","","00:51:06","","","","",{"$nulls":5},"Rik Taub ","M60 ",2.129166666666667,0.035486111111111114,"M","SV",null,null,"Rik Taub","M60","51:06","L",0.035486111111111114,null,true]
[null,null,47,"Malcolm Kemp ","00:51:06","M","SV","M SV",6,1,{"$nulls":6},6,{"$nulls":4},"","","","","",1,"","","",null,"","","","","","00:51:06","","","",{"$nulls":5},"Malcolm Kemp ","M60 ",2.1291667824074074,0.03548611304012346,"M","SV",null,null,"Malcolm Kemp","M60","51:06","ESTIMATE",0.035486111111111114,null,false,".01 adjust to avoid equal ranking"]
[null,null,48,"Ella Grabsky ","01:00:42","F","S","F S",11,1,{"$nulls":7},"as F V",{"$nulls":3},"","","","","","",1.125,"","",null,"","","","","","","01:08:17.250","","",{"$nulls":5},"Ella Grabsky ","F16-44 ",2.529166666666667,0.04215277777777778,"F","S",null,null,"Ella Grabsky","F16-44","60:42","ESTIMATE",0.04215277777777778,null,true]
[null,null,49,"Phil Grabsky ","01:00:42","M","V","M V",15,1,{"$nulls":8},"as FV",null,null,"","","","","","","",1.125,"",null,"","","","","","","","01:08:17.250","",{"$nulls":5},"Phil Grabsky ","M45-59 ",2.529166666666667,0.04215277777777778,"M","V",null,null,"Phil Grabsky","M45-59","60:42","SEGMENT",0.04215277777777778,null,true]
[null,null,50,"Richard Thompson ","01:01:36","M","V","M V",16,1,{"$nulls":8},"as M SV",null,null,"","","","","","","",1.125,"",null,"","","","","","","","01:09:18","",{"$nulls":5},"Richard Thompson ","M45-59 ",2.566666666666667,0.04277777777777778,"M","V",null,null,"Richard Thompson","M45-59","61:36","L",0.04277777777777778,null,true]
[null,null,51,{"$nulls":18},"","","","","","","","","",null,"","","","","","","","",""]
[null,null,52]
[{"$nulls":8},{"$f":"HHH!I61","v":{"v":0.1,"d":"10%"}},null,"check",{"$f":"COUNTA(L7:L57)","v":6},{"$f":"COUNTA(M7:M57)","v":6},6,6,6,6,6,5,3]
[{"$nulls":8},{"$f":"TEXT(I59,\"0.0%\")","v":"10.0%"}]
[{"$nulls":4},"average",null,"cat","Count",{"$f":"\"AVG + \"&I60","v":"AVG + 10.0%"},{"$nulls":9},"Additional Cats","Additional Cats"]
[{"$nulls":4},{"$f":"SUMIF($H$7:$H$57,G62,$E$7:$E$57)/H62","v":"00:32:23.100"},null,"M S",{"$f":"COUNTIF($H$7:$H$57,G62)","v":10},{"$f":"E62*(1+$I$59)","v":"00:35:37.410"},{"$nulls":36},"  ","  "," "]
[{"$nulls":4},{"$f":"SUMIF($H$7:$H$57,G63,$E$7:$E$57)/H63","v":"00:39:15.875"},null,"M V",{"$f":"COUNTIF($H$7:$H$57,G63)","v":16},{"$f":"E63*(1+$I$59)","v":"00:43:11.463"},{"$nulls":36},"  ","  "," "]
[{"$nulls":4},"00:45:10.667",null,"M SV",6,"00:49:41.733",{"$nulls":10},"M SV",{"$nulls":9},1,{"$nulls":9},{"$f":"INDEX($E$62:$I$67,MATCH(T64,$G$62:$G$67,0),5)*AD64","v":"00:49:41.733"},{"$nulls":5},"  ","  "," "]
[{"$nulls":4},"00:40:57.545",null,"F S",11,"00:45:03.300",{"$nulls":36},"  ","  "," "]
[{"$nulls":4},"00:42:40.500",null,"F V",6,"00:46:56.550",{"$nulls":10},"F V",{"$nulls":9},1,{"$nulls":9},"00:46:56.550"]
[{"$nulls":4},"00:49:49",null,"F SV",1,"00:54:47.900",{"$nulls":9},"F SV","F SV",{"$nulls":8},1,1,{"$nulls":8},"00:54:47.900","00:54:47.900"]
[]
[{"$nulls":7},{"$f":"SUM(H62:H68)","v":50}]
[{"$nulls":21},"Note"]
[{"$nulls":21},"the fastest runner in a team category is always allocated to their \"natural category\""]
[]
[]
[]
[{"$nulls":45},"  ","  "," "]
[{"$nulls":45},"  ","  "," "]
[{"$nulls":45},"  ","  "," "]
[{"$nulls":45},"  ","  "," "]
[{"$nulls":45},"  ","  "," "]
[{"$nulls":45},"  ","  "," "]
[{"$nulls":45},"  ","  "," "]

{"sheet":"BHR","index":5,"n_rows":45,"n_cols":42,"rows_kept":45,"merged":[[1,23,1,27],[3,10,3,15],[3,17,3,21],[44,17,44,21]]}
[{"$nulls":3},{"$f":"MID(CELL(\"filename\",A1),FIND(\"]\",CELL(\"filename\",A1))+1,255)","v":"BHR"}]
[{"$nulls":6},"S","=to V44",{"$nulls":3},1,2,3,4,5,{"$nulls":7},"Team Time"]
[{"$nulls":6},"V","= V45-V59"]
[{"$nulls":6},"SV","=V60+",null,null,"Team allocation",{"$nulls":6},"Correction factors",{"$nulls":5},{"$f":"SUM(X7:X41)","v":0.17614583333333333},0.2045601851851852,0.20736612962962964,{"$f":"SUM(AA7:AA41)","v":0.24226268518518518}]
[]
[null,null,"posn",null,"time","Gender","Age cat","Gen/Age","rank in cat",null,null,"Team A","Team B","Team C","Team D","Team E",null,"Team A","Team B","Team C","Team D","Team E",null,"Team A","Team B","Team C","Team D","Team E",{"$nulls":6},"Name",null,null,"Age","Date","Time","Strava Y/N","Time 2"]
[null,null,1,{"$f":"AI7","v":"Owen Wallek"},{"$f":"AP7","v":"00:31:50"},{"$f":"AJ7","v":"M"},{"$f":"AK7","v":"S"},{"$f":"F7&\" \"&G7","v":"M S"},{"$f":"COUNTIFS($H$7:$H$31,H7,$E$7:$E$31,\"<\"&E7)+1","v":1},{"$f":"COUNTA(L7:P7)","v":1},null,1,{"$nulls":5},{"$f":"IF(ISBLANK(L7)=TRUE(),\"\",IF(ISNUMBER(L7)=TRUE(),1,\"overwrite manually\"))","v":1},{"$f":"IF(ISBLANK(M7)=TRUE(),\"\",IF(ISNUMBER(M7)=TRUE(),1,\"overwrite manually\"))","v":""},"","","",null,{"$f":"IFERROR(R7*$E7,\"\")","v":"00:31:50"},{"$f":"IFERROR(S7*$E7,\"\")","v":""},"","","",{"$nulls":6},"Owen Wallek","M","S","S","2020-12-12","31 - 50","Y",{"$f":"LEFT(AN7,2)/24/60+RIGHT(AN7,2)/24/60/60","v":"00:31:50"}]
[null,null,2,{"$f":"AI8","v":"Philip Wallek"},{"$f":"AP8","v":"00:33:24"},{"$f":"AJ8","v":"M"},{"$f":"AK8","v":"S"},{"$f":"F8&\" \"&G8","v":"M S"},{"$f":"COUNTIFS($H$7:$H$31,H8,$E$7:$E$31,\"<\"&E8)+1","v":2},{"$f":"COUNTA(L8:P8)","v":1},null,null,2,{"$nulls":4},{"$f":"IF(ISBLANK(L8)=TRUE(),\"\",IF(ISNUMBER(L8)=TRUE(),1,\"overwrite manually\"))","v":""},1,"","","",null,{"$f":"IFERROR(R8*$E8,\"\")","v":""},"00:33:24","","","",{"$nulls":6},"Philip Wallek","M","S","S","2020-12-12","33 - 24","Y",{"$f":"LEFT(AN8,2)/24/60+RIGHT(AN8,2)/24/60/60","v":"00:33:24"}]
[null,null,3,"Mark Nichol 1","00:34:34","M","S","M S",3,1,{"$nulls":3},3,{"$nulls":3},"","",1,"","",null,"","","00:34:34","","",{"$nulls":6},"Mark Nichol 1","M","S","S","2020-12-08","34 - 34","Y","00:34:34"]
[null,null,4,"Oliver Day","00:35:07","M","V","M V",1,1,null,1,{"$nulls":5},1,"","","","",null,"00:35:07","","","","",{"$nulls":6},"Oliver Day","M","V","45-59","2020-12-08","35 - 07","Y","00:35:07"]
[null,null,5,"Ian Jones ","00:37:54","M","V","M V",2,1,null,null,2,{"$nulls":4},"",1,"","","",null,"","00:37:54","","","",{"$nulls":6},"Ian Jones ","M","V","45-59","2020-12-13","37 - 54","Y","00:37:54"]
[null,null,6,"Jamie Goodhead","00:38:39","M","V","M V",3,1,{"$nulls":3},3,{"$nulls":3},"","",1,"","",null,"","","00:38:39","","",{"$nulls":6},"Jamie Goodhead","M","V","45-59","2020-12-08","38 - 39","Y","00:38:39"]
[null,null,7,"Flo Wolfe","00:42:57","F","S","F S",1,1,null,1,{"$nulls":5},1,"","","","",null,"00:42:57","","","","",{"$nulls":6},"Flo Wolfe","F","S","S","2020-12-13","42 - 57","Y","00:42:57"]
[null,null,8,"Stuart Condie","00:43:10","M","SV","M SV",1,1,null,1,{"$nulls":5},1,"","","","",null,"00:43:10","","","","",{"$nulls":6},"Stuart Condie","M","SV","60+","2020-12-07","43 - 10","N","00:43:10"]
[null,null,9,"Steve Barrett","00:44:52","M","S","M S",4,1,{"$nulls":4},4,null,null,"","","",1,"",null,"","","","00:44:52","",{"$nulls":6},"Steve Barrett","M","S","S","2020-12-12","44 - 52","Y","00:44:52"]
[null,null,10,"Richard Light","00:45:25","M","SV","M SV",2,1,null,null,2,{"$nulls":4},"",1,"","","",null,"","00:45:25","","","",{"$nulls":6},"Richard Light","M","SV","60+","2020-12-12","45 - 25","Y","00:45:25"]
[null,null,11,"Thomas Peel-Yates","00:46:43","M","V","M V",4,1,{"$nulls":4},4,null,null,"","","",1,"",null,"","","","00:46:43","",{"$nulls":6},"Thomas Peel-Yates","M","V","45-59","2020-12-12","46 - 43","Y","00:46:43"]
[null,null,12,"Mercy Dennis-Smith","00:46:50","F","S","F S",2,1,null,null,2,{"$nulls":4},"",1,"","","",null,"","00:46:50","","","",{"$nulls":6},"Mercy Dennis-Smith","F","S","S","2020-12-13","46 - 50","Y","00:46:50"]
[null,null,13,"Cameron Cooper","00:47:57","M","S","M S",5,1,{"$nulls":3},"as F V",{"$nulls":3},"","",1.2656,"","",null,"","","01:00:41.131","","",{"$nulls":6},"Cameron Cooper","M","S","S","2020-12-12","47 - 57","Y","00:47:57"]
[null,null,14,"Bill Whitehead","00:48:24","M","V","M V",5,1,{"$nulls":3},"as F SV",{"$nulls":3},"","",1.2656,"","",null,"","","01:01:15.302","","",{"$nulls":6},"Bill Whitehead","M","V","45-59","2020-12-13","48 - 24","N","00:48:24"]
[null,null,15,"Nicky Callus","00:49:35","F","SV","F SV",1,1,null,1,{"$nulls":5},1,"","","","",null,"00:49:35","","","","",{"$nulls":6},"Nicky Callus","F","SV","60+","2020-12-06","49 - 35","Y","00:49:35"]
[null,null,16,"Chris Hine","00:50:35","M","S","M S",6,1,{"$nulls":4},"as F V",null,null,"","","",1.2656,"",null,"","","","01:04:01.096","",{"$nulls":6},"Chris Hine","M","S","S","2020-12-12","50 - 35","Y","00:50:35"]
[null,null,17,"Emma Buckland","00:51:00","F","V","F V",1,1,null,1,{"$nulls":5},1,"","","",{"$f":"IF(ISBLANK(P23)=TRUE(),\"\",IF(ISNUMBER(P23)=TRUE(),1,\"overwrite manually\"))","v":""},null,"00:51:00","","","","",{"$nulls":6},"Emma Buckland","F","V","45-59","2020-12-06","51 - 00","Y","00:51:00"]
[null,null,18,"Pete Brownlie","00:51:40","M","SV","M SV",3,1,{"$nulls":3},3,{"$nulls":3},"","",1,"","",null,"","","00:51:40","","",{"$nulls":6},"Pete Brownlie","M","SV","60+","2020-12-07","51 - 40","N","00:51:40"]
[null,null,19,"Christelle Maugiron","00:51:47","F","S","F S",3,1,{"$nulls":3},3,{"$nulls":3},"","",1,"","",null,"","","00:51:47","","",{"$nulls":6},"Christelle Maugiron","F","S","S","2020-12-06","51 - 47","?","00:51:47"]
[null,null,20,"Kim Gow","00:52:53","F","SV","F SV",2,1,null,null,2,{"$nulls":4},"",1,"","","",null,"","00:52:53","","","",{"$nulls":6},"Kim Gow","F","SV","60+","2020-12-06","52 - 53","y","00:52:53"]
[null,null,21,"David Clark","01:01:54","M","SV","M SV",4,1,{"$nulls":4},4,null,null,"","","",1,"",null,"","","","01:01:54","",{"$nulls":6},"David Clark","M","SV","60+","2020-12-06","61-54","N","01:01:54"]
[null,null,22,"Isabelle Adlam","01:15:00","F","S","F S",4,1,{"$nulls":4},4,null,null,"","","",1,"",null,"","","","01:15:00","",{"$nulls":6},"Isabelle Adlam","F","S","S","2020-12-13","75 - 00","Y","01:15:00"]
[null,null,23,"Eileen Adlam","01:18:08","F","V","F V",2,1,null,null,2,{"$nulls":4},"",1,"","","",null,"","01:18:08","","","",{"$nulls":6},"Eileen Adlam","F","V","45-59","2020-12-13","78 - 08","N","01:18:08"]
[null,null,24,{"$nulls":14},"","","","","",null,"","","","",""]
[null,null,25,{"$nulls":14},"","","","","",null,"","","","",""]
[]
[{"$nulls":8},{"$f":"HHH!I61","v":{"v":0.1,"d":"10%"}},null,"check",{"$f":"COUNTA(L7:L31)","v":6},{"$f":"COUNTA(M7:M31)","v":6},6,5,0]
[{"$nulls":8},{"$f":"TEXT(I33,\"0.0%\")","v":"10.0%"}]
[{"$nulls":4},"average",null,"cat","Count",{"$f":"\"AVG + \"&I34","v":"AVG + 10.0%"},{"$nulls":5},"additional"]
[{"$nulls":4},{"$f":"SUMIF($H$7:$H$31,G36,$E$7:$E$31)/H36","v":"00:40:32"},null,"M S",{"$f":"COUNTIF($H$7:$H$31,G36)","v":6},{"$f":"E36*(1+$I$33)","v":"00:44:35.200"}]
[{"$nulls":4},{"$f":"SUMIF($H$7:$H$31,G37,$E$7:$E$31)/H37","v":"00:41:21.400"},null,"M V",{"$f":"COUNTIF($H$7:$H$31,G37)","v":5},{"$f":"E37*(1+$I$33)","v":"00:45:29.540"}]
[{"$nulls":4},"00:50:32.250",null,"M SV",4,"00:55:35.475"]
[{"$nulls":4},"00:54:08.500",null,"F S",4,"00:59:33.350"]
[{"$nulls":4},"01:04:34",null,"F V",2,"01:11:01.400"]
[{"$nulls":4},"00:51:14",null,"F SV",2,"00:56:21.400",{"$nulls":5},"F SV",{"$nulls":5},1,{"$nulls":5},{"$f":"INDEX($E$36:$I$41,MATCH(O41,$G$36:$G$41,0),5)*U41","v":"00:56:21.400"}]
[]
[{"$nulls":7},{"$f":"SUM(H36:H42)","v":23}]
[{"$nulls":17},"Note"]
[{"$nulls":17},"the fastest runner in a team category is always allocated to their \"natural category\""]

{"sheet":"Sheet3","index":6,"n_rows":0,"n_cols":0,"rows_kept":0}